{"text_format":"1","workbook":"xlsx","n_sheets":5,"sheets":["Zał.1_WPF_bazowy","WPF_AnalizaWsk_ProjektowanieJST","definicja","rysunki","DaneZrodlowe"],"not_rendered":{"charts":12,"images":0,"macros":1,"external_links":0,"defined_names":14,"comments":0,"pivot_tables":0},"unopened":[],"bounds":{"document_bytes":16777216,"sheet_cells":100000,"rows_first":2000,"rows_last":500,"rows_between":2000,"halvings":0,"cell_chars":16384,"cell_head_chars":4096},"cells_cut":0,"cells_raw":0,"read":"whole","date_system":"1900"}

{"sheet":"Zał.1_WPF_bazowy","index":0,"n_rows":196,"n_cols":17,"rows_kept":196,"cut":false,"hidden":false,"merged":[[0,4,0,5],[0,1,0,3],[0,9,0,11],[112,15,112,16],[111,15,111,16]]}
[null,"WIELOLETNIA PROGNOZA FINANSOWA  MIASTA BRZEZINY NA LATA 2016-2019                                                             WRAZ Z PROGNOZĄ DŁUGU NA LATA 2016-2024",null,null,"Wykonanie ",null,"Plan 3 kw.","Wykonanie ",{"$f":"\"\"","v":""},"Załącznik nr 1 do Uchwały Nr XX/129/2016                             Rady Miasta Brzeziny z dnia 28 stycznia 2016 roku"]
["X","Lp.","Nazwy serii (rysunki)","Wyszczególnienie",{"$f":"+F2-1","v":2013},{"$f":"+G2-1","v":2014},{"$f":"+H2","v":2015},{"$f":"+I2-1","v":2015},{"$f":"+DaneZrodlowe!$N$1","v":2016},{"$f":"+I2+1","v":2017},{"$f":"+J2+1","v":2018},2019,2020,2021,2022,2023,2024]
["x",1,"Dochody ogółem","Dochody ogółem",{"$f":"36897999.47","v":36897999.469999999},{"$f":"38775186.08","v":38775186.079999998},{"$f":"36552514.89","v":36552514.890000001},{"$f":"36552514.89","v":36552514.890000001},{"$f":"32174588","v":32174588},{"$f":"33100000","v":33100000},{"$f":"34100000","v":34100000},{"$f":"35100000","v":35100000},{"$f":"36100000","v":36100000},{"$f":"37100000","v":37100000},{"$f":"38100000","v":38100000},{"$f":"39100000","v":39100000},{"$f":"40100000","v":40100000}]
["x","1.1"," Dochody bieżące","Dochody bieżące",{"$f":"32301173.26","v":32301173.260000002},{"$f":"34105017.52","v":34105017.520000003},{"$f":"33742971.45","v":33742971.450000003},{"$f":"33742971.45","v":33742971.450000003},{"$f":"32044588","v":32044588},{"$f":"33100000","v":33100000},{"$f":"34100000","v":34100000},{"$f":"35100000","v":35100000},{"$f":"36100000","v":36100000},{"$f":"37100000","v":37100000},{"$f":"38100000","v":38100000},{"$f":"39100000","v":39100000},{"$f":"40100000","v":40100000}]
[null,"1.1.1","  dochody z tytułu udziału we wpływach z podatku dochodowego od osób fizycznych","dochody z tytułu udziału we wpływach z podatku dochodowego od osób fizycznych",{"$f":"6476099","v":6476099},{"$f":"7136023","v":7136023},{"$f":"7700000","v":7700000},{"$f":"7700000","v":7700000},{"$f":"8400000","v":8400000},{"$f":"9000000","v":9000000},{"$f":"9500000","v":9500000},{"$f":"10000000","v":10000000},{"$f":"0","v":0},{"$f":"0","v":0},{"$f":"0","v":0},{"$f":"0","v":0},{"$f":"0","v":0}]
[null,"1.1.2","  dochody z tytułu udziału we wpływach z podatku dochodowego od osób prawnych","dochody z tytułu udziału we wpływach z podatku dochodowego od osób prawnych",{"$f":"175600.93","v":175600.93},{"$f":"175787.56","v":175787.56},{"$f":"140000","v":140000},140000,140000,140000,140000,140000,{"$f":"0","v":0},{"$f":"0","v":0},{"$f":"0","v":0},{"$f":"0","v":0},{"$f":"0","v":0}]
[null,"1.1.3","  podatki i opłaty","podatki i opłaty",{"$f":"5289523.02","v":5289523.0199999996},{"$f":"7010289.27","v":7010289.2699999996},{"$f":"7628751","v":7628751},{"$f":"7628751","v":7628751},{"$f":"7223150","v":7223150},{"$f":"7300000","v":7300000},{"$f":"7400000","v":7400000},{"$f":"7500000","v":7500000},{"$f":"0","v":0},{"$f":"0","v":0},{"$f":"0","v":0},{"$f":"0","v":0},{"$f":"0","v":0}]
[null,"1.1.3.1","   z podatku od nieruchomości","z podatku od nieruchomości",{"$f":"3824840.21","v":3824840.21},{"$f":"4237030.5","v":4237030.5},{"$f":"4769505","v":4769505},{"$f":"4769505","v":4769505},{"$f":"4400000","v":4400000},{"$f":"4500000","v":4500000},{"$f":"4600000","v":4600000},{"$f":"4700000","v":4700000},{"$f":"0","v":0},{"$f":"0","v":0},{"$f":"0","v":0},{"$f":"0","v":0},{"$f":"0","v":0}]
[null,"1.1.4","  z subwencji ogólnej","z subwencji ogólnej",{"$f":"7466452","v":7466452},{"$f":"8308307","v":8308307},{"$f":"9112541","v":9112541},{"$f":"9112541","v":9112541},{"$f":"9238483","v":9238483},{"$f":"9300000","v":9300000},{"$f":"9400000","v":9400000},{"$f":"9500000","v":9500000},{"$f":"0","v":0},{"$f":"0","v":0},{"$f":"0","v":0},{"$f":"0","v":0},{"$f":"0","v":0}]
[null,"1.1.5","  z tytułu dotacji i środków przeznaczonych na cele bieżące","z tytułu dotacji i środków przeznaczonych na cele bieżące",{"$f":"8685748.05","v":8685748.0500000007},{"$f":"8330252.43","v":8330252.4299999997},{"$f":"6570203.45","v":6570203.4500000002},{"$f":"6570203.45","v":6570203.4500000002},{"$f":"5085967","v":5085967},{"$f":"5100000","v":5100000},{"$f":"5200000","v":5200000},{"$f":"5300000","v":5300000},{"$f":"0","v":0},{"$f":"0","v":0},{"$f":"0","v":0},{"$f":"0","v":0},{"$f":"0","v":0}]
["x","1.2","  Dochody majątkowe","Dochody majątkowe, w tym",{"$f":"4596826.21","v":4596826.21},{"$f":"4670168.56","v":4670168.5599999996},{"$f":"2809543.44","v":2809543.44},{"$f":"2809543.44","v":2809543.44},{"$f":"130000","v":130000},{"$f":"0","v":0},{"$f":"0","v":0},{"$f":"0","v":0},{"$f":"0","v":0},{"$f":"0","v":0},{"$f":"0","v":0},{"$f":"0","v":0},{"$f":"0","v":0}]
["x","1.2.1","  ze sprzedaży majątku","ze sprzedaży majątku",{"$f":"198768.84","v":198768.84},{"$f":"243965.6","v":243965.6},{"$f":"21000","v":21000},{"$f":"21000","v":21000},{"$f":"120000","v":120000},{"$f":"0","v":0},{"$f":"0","v":0},{"$f":"0","v":0},{"$f":"0","v":0},{"$f":"0","v":0},{"$f":"0","v":0},{"$f":"0","v":0},{"$f":"0","v":0}]
[null,"1.2.2","  z tytułu dotacji oraz środków przeznaczonych na inwestycje","z tytułu dotacji oraz środków przeznaczonych na inwestycje",{"$f":"4223796.09","v":4223796.09},{"$f":"4326916.96","v":4326916.96},{"$f":"2773543.44","v":2773543.44},{"$f":"2773543.44","v":2773543.44},{"$f":"0","v":0},{"$f":"0","v":0},{"$f":"0","v":0},{"$f":"0","v":0},{"$f":"0","v":0},{"$f":"0","v":0},{"$f":"0","v":0},{"$f":"0","v":0},{"$f":"0","v":0}]
["x",2,"Wydatki ogółem","Wydatki ogółem",{"$f":"37003938.3","v":37003938.299999997},{"$f":"37365699.93","v":37365699.93},{"$f":"42482913.27","v":42482913.270000003},{"$f":"42482913.27","v":42482913.270000003},{"$f":"32174588","v":32174588},{"$f":"31621796","v":31621796},{"$f":"32421796","v":32421796},{"$f":"33239996","v":33239996},{"$f":"33889996","v":33889996},{"$f":"34889996","v":34889996},{"$f":"35849996","v":35849996},{"$f":"36682000","v":36682000},{"$f":"36681616","v":36681616}]
["x","2.1"," Wydatki bieżące","Wydatki bieżące, w tym:",{"$f":"30174248.7","v":30174248.699999999},{"$f":"31284204.73","v":31284204.73},{"$f":"31963540.27","v":31963540.27},{"$f":"31963540.27","v":31963540.27},{"$f":"29810588","v":29810588},{"$f":"30200000","v":30200000},{"$f":"30700000","v":30700000},{"$f":"31200000","v":31200000},{"$f":"31700000","v":31700000},{"$f":"32200000","v":32200000},{"$f":"32700000","v":32700000},{"$f":"33200000","v":33200000},{"$f":"33700000","v":33700000}]
["x","2.1.1","  z tytułu poręczeń i gwarancji","z tytułu poręczeń i gwarancji",{"$f":"0","v":0},{"$f":"0","v":0},{"$f":"28000","v":28000},{"$f":"28000","v":28000},{"$f":"113000","v":113000},{"$f":"114000","v":114000},{"$f":"116000","v":116000},{"$f":"117000","v":117000},{"$f":"119000","v":119000},{"$f":"121000","v":121000},{"$f":"123000","v":123000},{"$f":"126000","v":126000},{"$f":"128000","v":128000}]
["x","2.1.1.1","   w tym: gwarancje i poręczenia podlegające wyłączeniu z limitu spłaty zobowiązań, o którym mowa w art. 243 ustawy","w tym: gwarancje i poręczenia podlegające wyłączeniu z limitu spłaty zobowiązań, o którym mowa w art. 243 ustawy",{"$f":"0","v":0},{"$f":"0","v":0},{"$f":"0","v":0},{"$f":"0","v":0},{"$f":"0","v":0},{"$f":"0","v":0},{"$f":"0","v":0},{"$f":"0","v":0},{"$f":"0","v":0},{"$f":"0","v":0},{"$f":"0","v":0},{"$f":"0","v":0},{"$f":"0","v":0}]
[null,"2.1.2","   na spłatę przejętych zobowiązań samodzielnego publicznego zakładu opieki zdrowotnej przekształconego na zasadach określonych w przepisach  o działalności leczniczej, w wysokości w jakiej nie podlegają sfinansowaniu dotacją z budżetu państwa","na spłatę przejętych zobowiązań samodzielnego publicznego zakładu opieki zdrowotnej przekształconego na zasadach określonych w przepisach  o działalności leczniczej, w wysokości w jakiej nie podlegają sfinansowaniu dotacją z budżetu państwa",{"$f":"0","v":0},{"$f":"0","v":0},{"$f":"0","v":0},{"$f":"0","v":0},{"$f":"0","v":0},{"$f":"0","v":0},{"$f":"0","v":0},{"$f":"0","v":0},{"$f":"0","v":0},{"$f":"0","v":0},{"$f":"0","v":0},{"$f":"0","v":0},{"$f":"0","v":0}]
["x","2.1.3","  wydatki na obsługę długu, w tym:","wydatki na obsługę długu, w tym:",{"$f":"657163.7","v":657163.69999999995},{"$f":"563582.46","v":563582.46},{"$f":"480000","v":480000},{"$f":"480000","v":480000},{"$f":"505000","v":505000},{"$f":"500000","v":500000},{"$f":"470000","v":470000},{"$f":"440000","v":440000},{"$f":"380000","v":380000},{"$f":"300000","v":300000},{"$f":"210000","v":210000},{"$f":"130000","v":130000},{"$f":"40000","v":40000}]
["x","2.1.3.1","   odsetki i dyskonto określone w art. 243 ust. 1 ustawy, w tym:","odsetki i dyskonto określone w art. 243 ust. 1 ustawy, w tym:",{"$f":"657163.7","v":657163.69999999995},{"$f":"563582.46","v":563582.46},{"$f":"475000","v":475000},{"$f":"475000","v":475000},{"$f":"500000","v":500000},{"$f":"500000","v":500000},{"$f":"470000","v":470000},{"$f":"440000","v":440000},{"$f":"380000","v":380000},{"$f":"300000","v":300000},{"$f":"210000","v":210000},{"$f":"130000","v":130000},{"$f":"40000","v":40000}]
["x","2.1.3.1.1","    odsetki i dyskonto podlegające wyłączeniu z limitu spłaty zobowiązań, o którym mowa w art. 243 ustawy, w terminie nie dłuższym niż 90 dni po zakończeniu programu, projektu lub zadania i otrzymaniu refundacji z tych środków (bez odsetek i dyskonta od zobowiązań na wkład krajowy)","odsetki i dyskonto podlegające wyłączeniu z limitu spłaty zobowiązań, o którym mowa w art. 243 ustawy, w terminie nie dłuższym niż 90 dni po zakończeniu programu, projektu lub zadania i otrzymaniu refundacji z tych środków (bez odsetek i dyskonta od zobowiązań na wkład krajowy)",{"$f":"0","v":0},{"$f":"0","v":0},{"$f":"0","v":0},{"$f":"0","v":0},{"$f":"0","v":0},{"$f":"0","v":0},{"$f":"0","v":0},{"$f":"0","v":0},{"$f":"0","v":0},{"$f":"0","v":0},{"$f":"0","v":0},{"$f":"0","v":0},{"$f":"0","v":0}]
["x","2.1.3.1.2","    odsetki i dyskonto podlegające wyłączeniu z limitu spłaty zobowiązań, o którym mowa w art. 243 ustawy, z tytułu zobowiązań  zaciągniętych na wkład krajowy","odsetki i dyskonto podlegające wyłączeniu z limitu spłaty zobowiązań, o którym mowa w art. 243 ustawy, z tytułu zobowiązań  zaciągniętych na wkład krajowy",{"$f":"0","v":0},{"$f":"0","v":0},{"$f":"0","v":0},{"$f":"0","v":0},{"$f":"0","v":0},{"$f":"0","v":0},{"$f":"0","v":0},{"$f":"0","v":0},{"$f":"0","v":0},{"$f":"0","v":0},{"$f":"0","v":0},{"$f":"0","v":0},{"$f":"0","v":0}]
["x","2.2"," Wydatki majątkowe","Wydatki majątkowe",{"$f":"6829689.6","v":6829689.5999999996},{"$f":"6081495.2","v":6081495.2000000002},{"$f":"10519373","v":10519373},{"$f":"10519373","v":10519373},{"$f":"2364000","v":2364000},{"$f":"1421796","v":1421796},{"$f":"1721796","v":1721796},{"$f":"2039996","v":2039996},{"$f":"2189996","v":2189996},{"$f":"2689996","v":2689996},{"$f":"3149996","v":3149996},{"$f":"3482000","v":3482000},{"$f":"2981616","v":2981616}]
["x",3,"Wynik budżetu","Wynik budżetu",{"$f":"-105938.83","v":-105938.83},{"$f":"1409486.15","v":1409486.15},{"$f":"-5930398.38","v":-5930398.3799999999},{"$f":"-5930398.38","v":-5930398.3799999999},{"$f":"0","v":0},{"$f":"1478204","v":1478204},{"$f":"1678204","v":1678204},{"$f":"1860004","v":1860004},{"$f":"2210004","v":2210004},{"$f":"2210004","v":2210004},{"$f":"2250004","v":2250004},{"$f":"2418000","v":2418000},{"$f":"3418384","v":3418384}]
["x",4,"Przychody budżetu","Przychody budżetu",{"$f":"7317411.22","v":7317411.2199999997},{"$f":"5010437.51","v":5010437.51},{"$f":"6846090.38","v":6846090.3799999999},{"$f":"6846090.38","v":6846090.3799999999},{"$f":"1215692","v":1215692},{"$f":"0","v":0},{"$f":"0","v":0},{"$f":"0","v":0},{"$f":"0","v":0},{"$f":"0","v":0},{"$f":"0","v":0},{"$f":"0","v":0},{"$f":"0","v":0}]
["x","4.1"," Nadwyżka budżetowa z lat ubiegłych","Nadwyżka budżetowa z lat ubiegłych",{"$f":"0","v":0},{"$f":"0","v":0},{"$f":"0","v":0},{"$f":"0","v":0},{"$f":"0","v":0},{"$f":"0","v":0},{"$f":"0","v":0},{"$f":"0","v":0},{"$f":"0","v":0},{"$f":"0","v":0},{"$f":"0","v":0},{"$f":"0","v":0},{"$f":"0","v":0}]
["x","4.1.1","  w tym na pokrycie deficytu budżetu","w tym na pokrycie deficytu budżetu",{"$f":"0","v":0},{"$f":"0","v":0},{"$f":"0","v":0},{"$f":"0","v":0},{"$f":"0","v":0},{"$f":"0","v":0},{"$f":"0","v":0},{"$f":"0","v":0},{"$f":"0","v":0},{"$f":"0","v":0},{"$f":"0","v":0},{"$f":"0","v":0},{"$f":"0","v":0}]
["x","4.2"," Wolne środki, o których mowa w art. 217 ust.2 pkt 6 ustawy","Wolne środki, o których mowa w art. 217 ust.2 pkt 6 ustawy",{"$f":"2607411.22","v":2607411.2200000002},{"$f":"2502437.51","v":2502437.5099999998},{"$f":"4393398.38","v":4393398.38},{"$f":"4393398.38","v":4393398.38},{"$f":"0","v":0},{"$f":"0","v":0},{"$f":"0","v":0},{"$f":"0","v":0},{"$f":"0","v":0},{"$f":"0","v":0},{"$f":"0","v":0},{"$f":"0","v":0},{"$f":"0","v":0}]
["x","4.2.1","   w tym na pokrycie deficytu budżetu","w tym na pokrycie deficytu budżetu",{"$f":"105938.83","v":105938.83},{"$f":"2502437.51","v":2502437.5099999998},{"$f":"4393398.38","v":4393398.38},{"$f":"4393398.38","v":4393398.38},{"$f":"0","v":0},{"$f":"0","v":0},{"$f":"0","v":0},{"$f":"0","v":0},{"$f":"0","v":0},{"$f":"0","v":0},{"$f":"0","v":0},{"$f":"0","v":0},{"$f":"0","v":0}]
["x","4.3","  Kredyty, pożyczki, emisja papierów wartościowych","Kredyty, pożyczki, emisja papierów wartościowych",{"$f":"4710000","v":4710000},{"$f":"2508000","v":2508000},{"$f":"2452692","v":2452692},{"$f":"2452692","v":2452692},{"$f":"1215692","v":1215692},{"$f":"0","v":0},{"$f":"0","v":0},{"$f":"0","v":0},{"$f":"0","v":0},{"$f":"0","v":0},{"$f":"0","v":0},{"$f":"0","v":0},{"$f":"0","v":0}]
["x","4.3.1","   w tym na pokrycie deficytu budżetu","w tym na pokrycie deficytu budżetu",{"$f":"0","v":0},{"$f":"0","v":0},{"$f":"1537000","v":1537000},{"$f":"1537000","v":1537000},{"$f":"0","v":0},{"$f":"0","v":0},{"$f":"0","v":0},{"$f":"0","v":0},{"$f":"0","v":0},{"$f":"0","v":0},{"$f":"0","v":0},{"$f":"0","v":0},{"$f":"0","v":0}]
["x","4.4"," Inne przychody niezwiązane z zaciągnięciem długu"," Inne przychody niezwiązane z zaciągnięciem długu",{"$f":"0","v":0},{"$f":"0","v":0},{"$f":"0","v":0},{"$f":"0","v":0},{"$f":"0","v":0},{"$f":"0","v":0},{"$f":"0","v":0},{"$f":"0","v":0},{"$f":"0","v":0},{"$f":"0","v":0},{"$f":"0","v":0},{"$f":"0","v":0},{"$f":"0","v":0}]
["x","4.4.1","   w tym na pokrycie deficytu budżetu","w tym na pokrycie deficytu budżetu",{"$f":"0","v":0},{"$f":"0","v":0},{"$f":"0","v":0},{"$f":"0","v":0},{"$f":"0","v":0},{"$f":"0","v":0},{"$f":"0","v":0},{"$f":"0","v":0},{"$f":"0","v":0},{"$f":"0","v":0},{"$f":"0","v":0},{"$f":"0","v":0},{"$f":"0","v":0}]
["x",5,"Rozchody budżetu","Rozchody budżetu",{"$f":"1903176.7","v":1903176.7},{"$f":"2026525.28","v":2026525.28},{"$f":"915692","v":915692},{"$f":"915692","v":915692},{"$f":"1215692","v":1215692},{"$f":"1478204","v":1478204},{"$f":"1678204","v":1678204},{"$f":"1860004","v":1860004},{"$f":"2210004","v":2210004},{"$f":"2210004","v":2210004},{"$f":"2250004","v":2250004},{"$f":"2418000","v":2418000},{"$f":"3418384","v":3418384}]
["x","5.1"," Spłaty rat kapitałowych kredytów i pożyczek oraz wykup papierów wartościowych","Spłaty rat kapitałowych kredytów i pożyczek oraz wykup papierów wartościowych",{"$f":"1903176.7","v":1903176.7},{"$f":"2026525.28","v":2026525.28},{"$f":"915692","v":915692},{"$f":"915692","v":915692},{"$f":"1215692","v":1215692},{"$f":"1478204","v":1478204},{"$f":"1678204","v":1678204},{"$f":"1860004","v":1860004},{"$f":"2210004","v":2210004},{"$f":"2210004","v":2210004},{"$f":"2250004","v":2250004},{"$f":"2418000","v":2418000},{"$f":"3418384","v":3418384}]
["x","5.1.1","  w tym łączna kwota przypadających na dany rok kwot ustawowych wyłączeń z limitu spłaty zobowiązań, o którym mowa w art. 243 ustawy, z tego:","w tym łączna kwota przypadających na dany rok kwot ustawowych wyłączeń z limitu spłaty zobowiązań, o którym mowa w art. 243 ustawy, z tego:",{"$f":"0","v":0},{"$f":"0","v":0},{"$f":"0","v":0},{"$f":"0","v":0},{"$f":"0","v":0},{"$f":"0","v":0},{"$f":"0","v":0},{"$f":"0","v":0},{"$f":"0","v":0},{"$f":"0","v":0},{"$f":"0","v":0},{"$f":"0","v":0},{"$f":"0","v":0}]
["x","5.1.1.1","   kwota przypadających na dany rok kwot ustawowych wyłączeń określonych w art. 243 ust. 3 ustawy","kwota przypadających na dany rok kwot ustawowych wyłączeń określonych w art. 243 ust. 3 ustawy",{"$f":"0","v":0},{"$f":"0","v":0},{"$f":"0","v":0},{"$f":"0","v":0},{"$f":"0","v":0},{"$f":"0","v":0},{"$f":"0","v":0},{"$f":"0","v":0},{"$f":"0","v":0},{"$f":"0","v":0},{"$f":"0","v":0},{"$f":"0","v":0},{"$f":"0","v":0}]
["x","5.1.1.2","   kwota przypadających na dany rok kwot ustawowych wyłączeń określonych w art. 243 ust. 3a ustawy","kwota przypadających na dany rok kwot ustawowych wyłączeń określonych w art. 243 ust. 3a ustawy",{"$f":"0","v":0},{"$f":"0","v":0},{"$f":"0","v":0},{"$f":"0","v":0},{"$f":"0","v":0},{"$f":"0","v":0},{"$f":"0","v":0},{"$f":"0","v":0},{"$f":"0","v":0},{"$f":"0","v":0},{"$f":"0","v":0},{"$f":"0","v":0},{"$f":"0","v":0}]
["x","5.1.1.3","   kwota przypadających na dany rok kwot ustawowych wyłączeń innych niż określone w art. 243 ustawy","kwota przypadających na dany rok kwot ustawowych wyłączeń innych niż określone w art. 243 ustawy",{"$f":"0","v":0},{"$f":"0","v":0},{"$f":"0","v":0},{"$f":"0","v":0},{"$f":"0","v":0},{"$f":"0","v":0},{"$f":"0","v":0},{"$f":"0","v":0},{"$f":"0","v":0},{"$f":"0","v":0},{"$f":"0","v":0},{"$f":"0","v":0},{"$f":"0","v":0}]
[null,"5.2"," Inne rozchody niezwiązane ze spłatą długu"," Inne rozchody niezwiązane ze spłatą długu",{"$f":"0","v":0},{"$f":"0","v":0},{"$f":"0","v":0},{"$f":"0","v":0},{"$f":"0","v":0},{"$f":"0","v":0},{"$f":"0","v":0},{"$f":"0","v":0},{"$f":"0","v":0},{"$f":"0","v":0},{"$f":"0","v":0},{"$f":"0","v":0},{"$f":"0","v":0}]
["x",6,"Kwota długu","Kwota długu",{"$f":"15503368.16","v":15503368.16},{"$f":"15985808","v":15985808},{"$f":"17522808","v":17522808},{"$f":"17522808","v":17522808},{"$f":"17522808","v":17522808},{"$f":"16044604","v":16044604},{"$f":"14366400","v":14366400},{"$f":"12506396","v":12506396},{"$f":"10296392","v":10296392},{"$f":"8086388","v":8086388},{"$f":"5836384","v":5836384},{"$f":"3418384","v":3418384},{"$f":"0","v":0}]
[null,7,"Kwota zobowiązań wynikających z przejęcia przez jednostkę samorządu terytorialnego zobowiązań po likwidowanych i przekształcanych jednostkach zaliczanych do sektora  finansów publicznych","Kwota zobowiązań wynikających z przejęcia przez jednostkę samorządu terytorialnego zobowiązań po likwidowanych i przekształcanych jednostkach zaliczanych do sektora  finansów publicznych",{"$f":"0","v":0},{"$f":"0","v":0},{"$f":"0","v":0},{"$f":"0","v":0},{"$f":"0","v":0},{"$f":"0","v":0},{"$f":"0","v":0},{"$f":"0","v":0},{"$f":"0","v":0},{"$f":"0","v":0},{"$f":"0","v":0},{"$f":"0","v":0},{"$f":"0","v":0}]
[null,8,"Relacja zrównoważenia wydatków bieżących, o której mowa w art. 242 ustawy","Relacja zrównoważenia wydatków bieżących, o której mowa w art. 242 ustawy","x","x","x","x","x","x","x","x","x","x","x","x","x"]
[null,"8.1"," Różnica między dochodami bieżącymi a  wydatkami bieżącymi","Różnica między dochodami bieżącymi a  wydatkami bieżącymi",{"$f":"2126924.56","v":2126924.56},{"$f":"2820812.79","v":2820812.79},{"$f":"1779431.18","v":1779431.18},{"$f":"1779431.18","v":1779431.18},{"$f":"2234000","v":2234000},{"$f":"2900000","v":2900000},{"$f":"3400000","v":3400000},{"$f":"3900000","v":3900000},{"$f":"4400000","v":4400000},{"$f":"4900000","v":4900000},{"$f":"5400000","v":5400000},{"$f":"5900000","v":5900000},{"$f":"6400000","v":6400000}]
[null,"8.2"," Różnica między dochodami bieżącymi, skorygowanymi o środki a wydatkami bieżącymi, pomniejszonymi  o wydatki","Różnica między dochodami bieżącymi, skorygowanymi o środki a wydatkami bieżącymi, pomniejszonymi  o wydatki",{"$f":"4734335.78","v":4734335.78},{"$f":"5323250.3","v":5323250.3},{"$f":"6172829.56","v":6172829.5599999996},{"$f":"6172829.56","v":6172829.5599999996},{"$f":"2234000","v":2234000},{"$f":"2900000","v":2900000},{"$f":"3400000","v":3400000},{"$f":"3900000","v":3900000},{"$f":"4400000","v":4400000},{"$f":"4900000","v":4900000},{"$f":"5400000","v":5400000},{"$f":"5900000","v":5900000},{"$f":"6400000","v":6400000}]
["x",9,"Wskaźnik spłaty zobowiązań","Wskaźnik spłaty zobowiązań","x","x","x","x","x","x","x","x","x","x","x","x","x"]
["x","9.1","(R+O) / D (bez wyłączeń)","Wskaźnik planowanej łącznej kwoty spłaty zobowiązań, o której mowa w art. 243 ust. 1 ustawy do dochodów, bez uwzględnienia zobowiązań związku współtworzonego przez jednostkę samorządu terytorialnego  i bez uwzględnienia ustawowych wyłączeń przypadających na dany rok.",{"$f":"0.0694","v":6.9400000000000003E-2},{"$f":"0.0668","v":6.6799999999999998E-2},{"$f":"0.0388","v":3.8800000000000001E-2},{"$f":"0.0388","v":3.8800000000000001E-2},{"$f":"0.0568","v":5.6800000000000003E-2},{"$f":"0.0632","v":6.3200000000000006E-2},{"$f":"0.0664","v":6.6400000000000001E-2},{"$f":"0.0689","v":6.8900000000000003E-2},{"$f":"0.075","v":7.4999999999999997E-2},{"$f":"0.0709","v":7.0900000000000005E-2},{"$f":"0.0678","v":6.7799999999999999E-2},{"$f":"0.0684","v":6.8400000000000002E-2},{"$f":"0.0894","v":8.9399999999999993E-2}]
["x","9.2","(R+O) / D (z wyłączeniami)","Wskaźnik planowanej łącznej kwoty spłaty zobowiązań, o której mowa w art. 243 ust. 1 ustawy do dochodów, bez uwzględnienia zobowiązań związku współtworzonego przez jednostkę samorządu terytorialnego, po uwzględnieniu ustawowych wyłączeń przypadających na dany rok.",{"$f":"0.0694","v":6.9400000000000003E-2},{"$f":"0.0668","v":6.6799999999999998E-2},{"$f":"0.0388","v":3.8800000000000001E-2},{"$f":"0.0388","v":3.8800000000000001E-2},{"$f":"0.0568","v":5.6800000000000003E-2},{"$f":"0.0632","v":6.3200000000000006E-2},{"$f":"0.0664","v":6.6400000000000001E-2},{"$f":"0.0689","v":6.8900000000000003E-2},{"$f":"0.075","v":7.4999999999999997E-2},{"$f":"0.0709","v":7.0900000000000005E-2},{"$f":"0.0678","v":6.7799999999999999E-2},{"$f":"0.0684","v":6.8400000000000002E-2},{"$f":"0.0894","v":8.9399999999999993E-2}]
["x","9.3"," Kwota zobowiązań związku współtworzonego przez jednostkę samorządu terytorialnego przypadających do spłaty w danym roku budżetowym, podlegająca doliczeniu zgodnie z art. 244 ustawy","Kwota zobowiązań związku współtworzonego przez jednostkę samorządu terytorialnego przypadających do spłaty w danym roku budżetowym, podlegająca doliczeniu zgodnie z art. 244 ustawy",{"$f":"0","v":0},{"$f":"0","v":0},{"$f":"0","v":0},{"$f":"0","v":0},{"$f":"0","v":0},{"$f":"0","v":0},{"$f":"0","v":0},{"$f":"0","v":0},{"$f":"0","v":0},{"$f":"0","v":0},{"$f":"0","v":0},{"$f":"0","v":0},{"$f":"0","v":0}]
["x","9.4","(R+O) / D (z wyłączeniami i zobowiązaniami związków)","Wskaźnik planowanej łącznej kwoty spłaty zobowiązań, o której mowa w art. 243 ust. 1 ustawy do dochodów, po uwzględnieniu zobowiązań związku współtworzonego przez jednostkę samorządu terytorialnego oraz po uwzględnieniu ustawowych wyłączeń przypadających na dany rok",{"$f":"0.0694","v":6.9400000000000003E-2},{"$f":"0.0668","v":6.6799999999999998E-2},{"$f":"0.0388","v":3.8800000000000001E-2},{"$f":"0.0388","v":3.8800000000000001E-2},{"$f":"0.0568","v":5.6800000000000003E-2},{"$f":"0.0632","v":6.3200000000000006E-2},{"$f":"0.0664","v":6.6400000000000001E-2},{"$f":"0.0689","v":6.8900000000000003E-2},{"$f":"0.075","v":7.4999999999999997E-2},{"$f":"0.0709","v":7.0900000000000005E-2},{"$f":"0.0678","v":6.7799999999999999E-2},{"$f":"0.0684","v":6.8400000000000002E-2},{"$f":"0.0894","v":8.9399999999999993E-2}]
["x","9.5"," Wskaźnik dochodów bieżących powiększonych o dochody ze sprzedaży majątku oraz pomniejszonych o wydatki bieżące, do dochodów budżetu, ustalony dla danego roku (wskaźnik jednoroczny)","Wskaźnik dochodów bieżących powiększonych o dochody ze sprzedaży majątku oraz pomniejszonych o wydatki bieżące, do dochodów budżetu, ustalony dla danego roku (wskaźnik jednoroczny)",{"$f":"+IF(AND(E2>=2013,E2<=2018),IF(E3<>0,(E4+E12-E15+E18)/E3,0),IF(E3<>0,(E4+E12-E15)/E3,0))","v":6.3030338593042495E-2},7.9039682328714805E-2,4.9256013858914087E-2,4.9256013858914087E-2,7.3163330016844344E-2,8.7613293051359523E-2,9.9706744868035185E-2,0.1111111111111111,0.12188365650969529,0.13207547169811321,0.14173228346456693,0.15089514066496162,0.15960099750623441]
["x","9.6","Dopuszczalny wskaźnik spłaty zobowiązań z art. 243 ustawy, po uwzględnieniu ustawowych wyłączeń (planistyczny) ","Dopuszczalny wskaźnik spłaty zobowiązań określony w art. 243 ustawy, po uwzględnieniu ustawowych wyłączeń , obliczony w oparciu o plan 3 kwartału roku poprzedzającego pierwszy rok prognozy (wskaźnik ustalony w oparciu o średnią arytmetyczną z 3 poprzednich lat) ","x","x","x","x",{"$f":"0.0638","v":6.3799999999999996E-2},{"$f":"0.0672","v":6.7199999999999996E-2},{"$f":"0.07","v":7.0000000000000007E-2},{"$f":"0.0868","v":8.6800000000000002E-2},{"$f":"0.0995","v":9.9500000000000005E-2},{"$f":"0.1109","v":0.1109},{"$f":"0.1217","v":0.1217},{"$f":"0.1319","v":0.13189999999999999},{"$f":"0.1416","v":0.1416}]
["x","9.6.1","Dopuszczalny wskaźnik spłaty zobowiązań z art. 243 ustawy, po uwzględnieniu ustawowych wyłączeń (wykonanie) ","Dopuszczalny wskaźnik spłaty zobowiązań określony w art. 243 ustawy, po uwzględnieniu ustawowych wyłączeń, obliczony w oparciu o wykonanie roku poprzedzającego pierwszy rok prognozy (wskaźnik ustalony w oparciu o średnią arytmetyczną z 3 poprzednich lat) ","x","x","x","x",{"$f":"0.0638","v":6.3799999999999996E-2},{"$f":"0.0672","v":6.7199999999999996E-2},{"$f":"0.07","v":7.0000000000000007E-2},{"$f":"0.0868","v":8.6800000000000002E-2},{"$f":"0.0995","v":9.9500000000000005E-2},{"$f":"0.1109","v":0.1109},{"$f":"0.1217","v":0.1217},{"$f":"0.1319","v":0.13189999999999999},{"$f":"0.1416","v":0.1416}]
["x","9.7"," Informacja o spełnieniu wskaźnika spłaty zobowiązań określonego w art. 243 ustawy, po uwzględnieniu zobowiązań związku współtworzonego przez jednostkę samorządu terytorialnego oraz po uwzględnieniu ustawowych wyłączeń, obliczonego w oparciu o plan 3 kwartałów roku poprzedzającego rok budżetowy","Informacja o spełnieniu wskaźnika spłaty zobowiązań określonego w art. 243 ustawy, po uwzględnieniu zobowiązań związku współtworzonego przez jednostkę samorządu terytorialnego oraz po uwzględnieniu ustawowych wyłączeń, obliczonego w oparciu o plan 3 kwartałów roku poprzedzającego rok budżetowy","x","x","x","x",{"$f":"IF(I50<=I52,\"Spełniona\",\"Nie spełniona\")","v":"Spełniona"},{"$f":"IF(J50<=J52,\"Spełniona\",\"Nie spełniona\")","v":"Spełniona"},"Spełniona","Spełniona","Spełniona","Spełniona","Spełniona","Spełniona","Spełniona"]
["x","9.7.1","  Informacja o spełnieniu wskaźnika spłaty zobowiązań określonego w art. 243 ustawy, po uwzględnieniu zobowiązań związku współtworzonego przez jednostkę samorządu terytorialnego oraz po uwzględnieniu ustawowych wyłączeń, obliczonego w oparciu o wykonanie roku poprzedzającego rok budżetowy","Informacja o spełnieniu wskaźnika spłaty zobowiązań określonego w art. 243 ustawy, po uwzględnieniu zobowiązań związku współtworzonego przez jednostkę samorządu terytorialnego oraz po uwzględnieniu ustawowych wyłączeń, obliczonego w oparciu o wykonanie roku poprzedzającego rok budżetowy","x","x","x","x",{"$f":"IF(I50<=I53,\"Spełniona\",\"Nie spełniona\")","v":"Spełniona"},{"$f":"IF(J50<=J53,\"Spełniona\",\"Nie spełniona\")","v":"Spełniona"},"Spełniona","Spełniona","Spełniona","Spełniona","Spełniona","Spełniona","Spełniona"]
[null,10,"Przeznaczenie prognozowanej nadwyżki budżetowej,  w tym na:","Przeznaczenie prognozowanej nadwyżki budżetowej,  w tym na:",{"$f":"0","v":0},{"$f":"0","v":0},{"$f":"0","v":0},{"$f":"0","v":0},{"$f":"0","v":0},{"$f":"1478204","v":1478204},{"$f":"1678204","v":1678204},{"$f":"1860004","v":1860004},{"$f":"2210004","v":2210004},{"$f":"2210004","v":2210004},{"$f":"2250004","v":2250004},{"$f":"2418000","v":2418000},{"$f":"3418384","v":3418384}]
[null,"10.1"," Spłaty kredytów, pożyczek i wykup papierów wartościowych","Spłaty kredytów, pożyczek i wykup papierów wartościowych",{"$f":"0","v":0},{"$f":"0","v":0},{"$f":"0","v":0},{"$f":"0","v":0},{"$f":"0","v":0},{"$f":"1478204","v":1478204},{"$f":"1678204","v":1678204},{"$f":"1860004","v":1860004},{"$f":"2210004","v":2210004},{"$f":"2210004","v":2210004},{"$f":"2250004","v":2250004},{"$f":"2418000","v":2418000},3418384]
[null,11,"Informacje uzupełniające o wybranych rodzajach wydatków budżetowych","Informacje uzupełniające o wybranych rodzajach wydatków budżetowych","x","x","x","x","x","x","x","x","x","x","x","x","x"]
[null,"11.1"," Wydatki bieżące na wynagrodzenia i składki od nich naliczane","Wydatki bieżące na wynagrodzenia i składki od nich naliczane",{"$f":"12368065.33","v":12368065.33},{"$f":"12844686.27","v":12844686.27},{"$f":"13946795.57","v":13946795.57},{"$f":"13946795.57","v":13946795.57},{"$f":"14764410","v":14764410},{"$f":"15000000","v":15000000},{"$f":"15300000","v":15300000},{"$f":"15600000","v":15600000},{"$f":"0","v":0},{"$f":"0","v":0},{"$f":"0","v":0},{"$f":"0","v":0},{"$f":"0","v":0}]
[null,"11.2"," Wydatki związane z funkcjonowaniem organów jednostki samorządu terytorialnego","Wydatki związane z funkcjonowaniem organów jednostki samorządu terytorialnego",{"$f":"2986207.91","v":2986207.91},{"$f":"3073324.39","v":3073324.39},{"$f":"3391850","v":3391850},{"$f":"3391850","v":3391850},{"$f":"3427000","v":3427000},{"$f":"3450000","v":3450000},{"$f":"3500000","v":3500000},{"$f":"3550000","v":3550000},{"$f":"0","v":0},{"$f":"0","v":0},{"$f":"0","v":0},{"$f":"0","v":0},{"$f":"0","v":0}]
[null,"11.3"," Wydatki objęte limitem, o którym mowa w art. 226 ust. 3 pkt 4 ustawy","Wydatki objęte limitem, o którym mowa w art. 226 ust. 3 pkt 4 ustawy",{"$f":"2706336.15","v":2706336.15},{"$f":"1320685.63","v":1320685.6299999999},{"$f":"1521985.68","v":1521985.68},{"$f":"1521985.68","v":1521985.68},{"$f":"847280","v":847280},{"$f":"1314520","v":1314520},{"$f":"600000","v":600000},{"$f":"0","v":0},{"$f":"0","v":0},{"$f":"0","v":0},{"$f":"0","v":0},{"$f":"0","v":0},{"$f":"0","v":0}]
[null,"11.3.1","   Wydatki bieżące na przedsięwzięcia","bieżące",{"$f":"885100.65","v":885100.65},{"$f":"1182848.52","v":1182848.52},{"$f":"1421985.68","v":1421985.68},{"$f":"1421985.68","v":1421985.68},{"$f":"3280","v":3280},{"$f":"5520","v":5520},{"$f":"0","v":0},{"$f":"0","v":0},{"$f":"0","v":0},{"$f":"0","v":0},{"$f":"0","v":0},{"$f":"0","v":0},{"$f":"0","v":0}]
[null,"11.3.2","   Wydatki majątkowe na przedsięwzięcia","majątkowe",{"$f":"1821235.5","v":1821235.5},{"$f":"137837.11","v":137837.10999999999},{"$f":"100000","v":100000},{"$f":"100000","v":100000},{"$f":"844000","v":844000},{"$f":"1309000","v":1309000},{"$f":"600000","v":600000},{"$f":"0","v":0},{"$f":"0","v":0},{"$f":"0","v":0},{"$f":"0","v":0},{"$f":"0","v":0},{"$f":"0","v":0}]
[null,"11.4"," Wydatki inwestycyjne kontynuowane ","Wydatki inwestycyjne kontynuowane ",{"$f":"4829267.54","v":4829267.54},{"$f":"2958206","v":2958206},{"$f":"6615873","v":6615873},{"$f":"6615873","v":6615873},{"$f":"1564000","v":1564000},{"$f":"0","v":0},{"$f":"0","v":0},{"$f":"0","v":0},{"$f":"0","v":0},{"$f":"0","v":0},{"$f":"0","v":0},{"$f":"0","v":0},{"$f":"0","v":0}]
[null,"11.5"," Nowe wydatki inwestycyjne","Nowe wydatki inwestycyjne",{"$f":"1680528.06","v":1680528.06},{"$f":"2364458.2","v":2364458.2000000002},{"$f":"2967100","v":2967100},{"$f":"2967100","v":2967100},{"$f":"520000","v":520000},{"$f":"0","v":0},{"$f":"0","v":0},{"$f":"0","v":0},{"$f":"0","v":0},{"$f":"0","v":0},{"$f":"0","v":0},{"$f":"0","v":0},{"$f":"0","v":0}]
[null,"11.6"," Wydatki majątkowe w formie dotacji ","Wydatki majątkowe w formie dotacji ",{"$f":"319894","v":319894},{"$f":"458831","v":458831},{"$f":"636400","v":636400},{"$f":"636400","v":636400},{"$f":"50000","v":50000},{"$f":"0","v":0},{"$f":"0","v":0},{"$f":"0","v":0},{"$f":"0","v":0},{"$f":"0","v":0},{"$f":"0","v":0},{"$f":"0","v":0},{"$f":"0","v":0}]
[null,12,"Finansowanie programów, projektów lub zadań realizowanych z udziałem środków, o których mowa w art. 5 ust. 1 pkt 2 i 3 ustawy","Finansowanie programów, projektów lub zadań realizowanych z udziałem środków, o których mowa w art. 5 ust. 1 pkt 2 i 3 ustawy","x","x","x","x","x","x","x","x","x","x","x","x","x"]
[null,"12.1"," Dochody bieżące  na programy, projekty lub zadania finansowane z udziałem środków, o których mowa w art. 5 ust. 1 pkt 2 i 3 ustawy","Dochody bieżące  na programy, projekty lub zadania finansowane z udziałem środków, o których mowa w art. 5 ust. 1 pkt 2 i 3 ustawy",{"$f":"1650681.03","v":1650681.03},{"$f":"2512141.17","v":2512141.17},{"$f":"1035267.09","v":1035267.09},{"$f":"1035267.09","v":1035267.09},{"$f":"0","v":0},{"$f":"0","v":0},{"$f":"0","v":0},{"$f":"0","v":0},{"$f":"0","v":0},{"$f":"0","v":0},{"$f":"0","v":0},{"$f":"0","v":0},{"$f":"0","v":0}]
[null,"12.1.1","  -  w tym środki określone w art. 5 ust. 1 pkt 2 ustawy","-  w tym środki określone w art. 5 ust. 1 pkt 2 ustawy",{"$f":"1484838.58","v":1484838.58},{"$f":"2271968.91","v":2271968.91},{"$f":"911911.76","v":911911.76},{"$f":"911911.76","v":911911.76},{"$f":"0","v":0},{"$f":"0","v":0},{"$f":"0","v":0},{"$f":"0","v":0},{"$f":"0","v":0},{"$f":"0","v":0},{"$f":"0","v":0},{"$f":"0","v":0},{"$f":"0","v":0}]
[null,"12.1.1.1","   - w tym środki określone w art. 5 ust. 1 pkt 2 ustawy wynikające wyłącznie z  zawartych umów na realizację programu, projektu lub zadania","- w tym środki określone w art. 5 ust. 1 pkt 2 ustawy wynikające wyłącznie z  zawartych umów na realizację programu, projektu lub zadania",{"$f":"1484838.58","v":1484838.58},{"$f":"2271968.91","v":2271968.91},{"$f":"911911.76","v":911911.76},{"$f":"911911.76","v":911911.76},{"$f":"0","v":0},{"$f":"0","v":0},{"$f":"0","v":0},{"$f":"0","v":0},{"$f":"0","v":0},{"$f":"0","v":0},{"$f":"0","v":0},{"$f":"0","v":0},{"$f":"0","v":0}]
[null,"12.2"," Dochody majątkowe  na programy, projekty lub zadania finansowane z udziałem środków, o których mowa w art. 5 ust. 1 pkt 2 i 3 ustawy","Dochody majątkowe  na programy, projekty lub zadania finansowane z udziałem środków, o których mowa w art. 5 ust. 1 pkt 2 i 3 ustawy",{"$f":"2951853.09","v":2951853.09},{"$f":"2340381.75","v":2340381.75},{"$f":"83947.5","v":83947.5},83947.5,{"$f":"0","v":0},{"$f":"0","v":0},{"$f":"0","v":0},{"$f":"0","v":0},{"$f":"0","v":0},{"$f":"0","v":0},{"$f":"0","v":0},{"$f":"0","v":0},{"$f":"0","v":0}]
[null,"12.2.1","   -  w tym środki określone w art. 5 ust. 1 pkt 2 ustawy","-  w tym środki określone w art. 5 ust. 1 pkt 2 ustawy",{"$f":"2897484.54","v":2897484.54},{"$f":"2339496.15","v":2339496.15},83947.5,83947.5,{"$f":"0","v":0},{"$f":"0","v":0},{"$f":"0","v":0},{"$f":"0","v":0},{"$f":"0","v":0},{"$f":"0","v":0},{"$f":"0","v":0},{"$f":"0","v":0},{"$f":"0","v":0}]
[null,"12.2.1.1","    - w tym środki określone w art. 5 ust. 1 pkt 2 ustawy wynikające wyłącznie z zawartych umów na realizację programu, projektu lub zadania","- w tym środki określone w art. 5 ust. 1 pkt 2 ustawy wynikające wyłącznie z zawartych umów na realizację programu, projektu lub zadania",{"$f":"2897484.54","v":2897484.54},{"$f":"2339496.15","v":2339496.15},83947.5,83947.5,{"$f":"0","v":0},{"$f":"0","v":0},{"$f":"0","v":0},{"$f":"0","v":0},{"$f":"0","v":0},{"$f":"0","v":0},{"$f":"0","v":0},{"$f":"0","v":0},{"$f":"0","v":0}]
[null,"12.3"," Wydatki bieżące na programy, projekty lub zadania finansowane z udziałem środków, o których mowa w art. 5 ust. 1 pkt 2 i 3 ustawy","Wydatki bieżące na programy, projekty lub zadania finansowane z udziałem środków, o których mowa w art. 5 ust. 1 pkt 2 i 3 ustawy",{"$f":"1714900.4","v":1714900.4},{"$f":"2804189.96","v":2804189.96},{"$f":"988921.26","v":988921.26},{"$f":"988921.26","v":988921.26},{"$f":"0","v":0},{"$f":"0","v":0},{"$f":"0","v":0},{"$f":"0","v":0},{"$f":"0","v":0},{"$f":"0","v":0},{"$f":"0","v":0},{"$f":"0","v":0},{"$f":"0","v":0}]
[null,"12.3.1","  -  w tym finansowane środkami określonymi w art. 5 ust. 1 pkt 2 ustawy ","-  w tym finansowane środkami określonymi w art. 5 ust. 1 pkt 2 ustawy ",{"$f":"1466388.17","v":1466388.17},{"$f":"2374365.08","v":2374365.08},{"$f":"834890.96","v":834890.96},{"$f":"834890.96","v":834890.96},{"$f":"0","v":0},{"$f":"0","v":0},{"$f":"0","v":0},{"$f":"0","v":0},{"$f":"0","v":0},{"$f":"0","v":0},{"$f":"0","v":0},{"$f":"0","v":0},{"$f":"0","v":0}]
[null,"12.3.2","  Wydatki bieżące na realizację programu, projektu lub zadania wynikające wyłącznie z zawartych umów z podmiotem dysponującym środkami, o których mowa w art. 5 ust. 1 pkt 2 ustawy ","Wydatki bieżące na realizację programu, projektu lub zadania wynikające wyłącznie z zawartych umów z podmiotem dysponującym środkami, o których mowa w art. 5 ust. 1 pkt 2 ustawy ",{"$f":"1714900.4","v":1714900.4},{"$f":"2804189.96","v":2804189.96},{"$f":"988921.26","v":988921.26},{"$f":"988921.26","v":988921.26},{"$f":"0","v":0},{"$f":"0","v":0},{"$f":"0","v":0},{"$f":"0","v":0},{"$f":"0","v":0},{"$f":"0","v":0},{"$f":"0","v":0},{"$f":"0","v":0},{"$f":"0","v":0}]
[null,"12.4"," Wydatki majątkowe na programy, projekty lub zadania finansowane z udziałem środków, o których mowa w art. 5 ust. 1 pkt 2 i 3 ustawy","Wydatki majątkowe na programy, projekty lub zadania finansowane z udziałem środków, o których mowa w art. 5 ust. 1 pkt 2 i 3 ustawy",{"$f":"579470.19","v":579470.18999999994},{"$f":"191094","v":191094},{"$f":"27150","v":27150},{"$f":"27150","v":27150},{"$f":"0","v":0},{"$f":"0","v":0},{"$f":"0","v":0},{"$f":"0","v":0},{"$f":"0","v":0},{"$f":"0","v":0},{"$f":"0","v":0},{"$f":"0","v":0},{"$f":"0","v":0}]
[null,"12.4.1","  -  w tym finansowane środkami określonymi w art. 5 ust. 1 pkt 2 ustawy","-  w tym finansowane środkami określonymi w art. 5 ust. 1 pkt 2 ustawy",{"$f":"428821.64","v":428821.64},{"$f":"134139.9","v":134139.9},{"$f":"27150","v":27150},{"$f":"27150","v":27150},{"$f":"0","v":0},{"$f":"0","v":0},{"$f":"0","v":0},{"$f":"0","v":0},{"$f":"0","v":0},{"$f":"0","v":0},{"$f":"0","v":0},{"$f":"0","v":0},{"$f":"0","v":0}]
[null,"12.4.2","  Wydatki majątkowe na realizację programu, projektu lub zadania wynikające wyłącznie z zawartych umów z podmiotem dysponującym środkami, o których mowa w art. 5 ust. 1 pkt 2 ustawy ","Wydatki majątkowe na realizację programu, projektu lub zadania wynikające wyłącznie z zawartych umów z podmiotem dysponującym środkami, o których mowa w art. 5 ust. 1 pkt 2 ustawy ",{"$f":"579470.19","v":579470.18999999994},{"$f":"191094","v":191094},{"$f":"27150","v":27150},{"$f":"27150","v":27150},{"$f":"0","v":0},{"$f":"0","v":0},{"$f":"0","v":0},{"$f":"0","v":0},{"$f":"0","v":0},{"$f":"0","v":0},{"$f":"0","v":0},{"$f":"0","v":0},{"$f":"0","v":0}]
[null,"12.5"," Wydatki na wkład krajowy w związku z umową na realizację programu, projektu lub zadania finansowanego z udziałem środków, o których mowa w art. 5 ust. 1 pkt 2 ustawy bez względu na stopień finansowania tymi środkami ","Wydatki na wkład krajowy w związku z umową na realizację programu, projektu lub zadania finansowanego z udziałem środków, o których mowa w art. 5 ust. 1 pkt 2 ustawy bez względu na stopień finansowania tymi środkami ",{"$f":"0","v":0},{"$f":"0","v":0},{"$f":"0","v":0},{"$f":"0","v":0},{"$f":"0","v":0},{"$f":"0","v":0},{"$f":"0","v":0},{"$f":"0","v":0},{"$f":"0","v":0},{"$f":"0","v":0},{"$f":"0","v":0},{"$f":"0","v":0},{"$f":"0","v":0}]
[null,"12.5.1","  w tym w związku z już zawartą umową na realizację programu, projektu lub zadania","w tym w związku z już zawartą umową na realizację programu, projektu lub zadania",{"$f":"0","v":0},{"$f":"0","v":0},{"$f":"0","v":0},{"$f":"0","v":0},{"$f":"0","v":0},{"$f":"0","v":0},{"$f":"0","v":0},{"$f":"0","v":0},{"$f":"0","v":0},{"$f":"0","v":0},{"$f":"0","v":0},{"$f":"0","v":0},{"$f":"0","v":0}]
[null,"12.6"," Wydatki na wkład krajowy w związku z zawartą po dniu 1 stycznia 2013 r. umową na realizację programu, projektu lub zadania finansowanego w co najmniej 60% środkami, o których mowa w art. 5 ust. 1 pkt 2 ustawy","Wydatki na wkład krajowy w związku z zawartą po dniu 1 stycznia 2013 r. umową na realizację programu, projektu lub zadania finansowanego w co najmniej 60% środkami, o których mowa w art. 5 ust. 1 pkt 2 ustawy",{"$f":"0","v":0},{"$f":"0","v":0},{"$f":"0","v":0},{"$f":"0","v":0},{"$f":"0","v":0},{"$f":"0","v":0},{"$f":"0","v":0},{"$f":"0","v":0},{"$f":"0","v":0},{"$f":"0","v":0},{"$f":"0","v":0},{"$f":"0","v":0},{"$f":"0","v":0}]
[null,"12.6.1","  w tym w związku z już zawartą umową na realizację programu, projektu lub zadania","w tym w związku z już zawartą umową na realizację programu, projektu lub zadania",{"$f":"0","v":0},{"$f":"0","v":0},{"$f":"0","v":0},{"$f":"0","v":0},{"$f":"0","v":0},{"$f":"0","v":0},{"$f":"0","v":0},{"$f":"0","v":0},{"$f":"0","v":0},{"$f":"0","v":0},{"$f":"0","v":0},{"$f":"0","v":0},{"$f":"0","v":0}]
[null,"12.7"," Przychody z tytułu kredytów, pożyczek, emisji papierów wartościowych powstające w związku z umową na realizację programu, projektu lub zadania finansowanego z udziałem środków, o których mowa w art. 5 ust. 1 pkt 2 ustawy bez względu na stopień finansowania tymi środkami ","Przychody z tytułu kredytów, pożyczek, emisji papierów wartościowych powstające w związku z umową na realizację programu, projektu lub zadania finansowanego z udziałem środków, o których mowa w art. 5 ust. 1 pkt 2 ustawy bez względu na stopień finansowania tymi środkami ",{"$f":"0","v":0},{"$f":"0","v":0},{"$f":"0","v":0},{"$f":"0","v":0},{"$f":"0","v":0},{"$f":"0","v":0},{"$f":"0","v":0},{"$f":"0","v":0},{"$f":"0","v":0},{"$f":"0","v":0},{"$f":"0","v":0},{"$f":"0","v":0},{"$f":"0","v":0}]
[null,"12.7.1","  w tym w związku z już zawartą umową na realizację programu, projektu lub zadania","w tym w związku z już zawartą umową na realizację programu, projektu lub zadania",{"$f":"0","v":0},{"$f":"0","v":0},{"$f":"0","v":0},{"$f":"0","v":0},{"$f":"0","v":0},{"$f":"0","v":0},{"$f":"0","v":0},{"$f":"0","v":0},{"$f":"0","v":0},{"$f":"0","v":0},{"$f":"0","v":0},{"$f":"0","v":0},{"$f":"0","v":0}]
[null,"12.8"," Przychody z tytułu kredytów, pożyczek, emisji papierów wartościowych powstające w związku z zawartą po dniu 1 stycznia 2013 r. umową na realizację programu, projektu lub zadania finansowanego w co najmniej 60% środkami, o których mowa w art. 5 ust. 1 pkt 2 ustawy","Przychody z tytułu kredytów, pożyczek, emisji papierów wartościowych powstające w związku z zawartą po dniu 1 stycznia 2013 r. umową na realizację programu, projektu lub zadania finansowanego w co najmniej 60% środkami, o których mowa w art. 5 ust. 1 pkt 2 ustawy",{"$f":"0","v":0},{"$f":"0","v":0},{"$f":"0","v":0},{"$f":"0","v":0},{"$f":"0","v":0},{"$f":"0","v":0},{"$f":"0","v":0},{"$f":"0","v":0},{"$f":"0","v":0},{"$f":"0","v":0},{"$f":"0","v":0},{"$f":"0","v":0},{"$f":"0","v":0}]
[null,"12.8.1","  w tym w związku z już zawartą umową na realizację programu, projektu lub zadania","w tym w związku z już zawartą umową na realizację programu, projektu lub zadania",{"$f":"0","v":0},{"$f":"0","v":0},{"$f":"0","v":0},{"$f":"0","v":0},{"$f":"0","v":0},{"$f":"0","v":0},{"$f":"0","v":0},{"$f":"0","v":0},{"$f":"0","v":0},{"$f":"0","v":0},{"$f":"0","v":0},{"$f":"0","v":0},{"$f":"0","v":0}]
[null,13,"Kwoty dotyczące przejęcia i spłaty zobowiązań po samodzielnych publicznych zakładach opieki zdrowotnej oraz pokrycia ujemnego wyniku ","Kwoty dotyczące przejęcia i spłaty zobowiązań po samodzielnych publicznych zakładach opieki zdrowotnej oraz pokrycia ujemnego wyniku ","x","x","x","x","x","x","x","x","x","x","x","x","x"]
[null,"13.1"," Kwota zobowiązań wynikających z przejęcia przez jednostkę samorządu terytorialnego zobowiązań po likwidowanych i przekształcanych samodzielnych zakładach opieki zdrowotnej","Kwota zobowiązań wynikających z przejęcia przez jednostkę samorządu terytorialnego zobowiązań po likwidowanych i przekształcanych samodzielnych zakładach opieki zdrowotnej",{"$f":"0","v":0},{"$f":"0","v":0},{"$f":"0","v":0},{"$f":"0","v":0},{"$f":"0","v":0},{"$f":"0","v":0},{"$f":"0","v":0},{"$f":"0","v":0},{"$f":"0","v":0},{"$f":"0","v":0},{"$f":"0","v":0},{"$f":"0","v":0},{"$f":"0","v":0}]
[null,"13.2"," Dochody budżetowe z tytułu dotacji celowej z budżetu państwa, o której mowa w art. 196 ustawy z  dnia 15 kwietnia 2011 r.  o działalności leczniczej (Dz.U. Nr 112, poz. 654, z późn. zm.)","Dochody budżetowe z tytułu dotacji celowej z budżetu państwa, o której mowa w art. 196 ustawy z  dnia 15 kwietnia 2011 r.  o działalności leczniczej (Dz.U. Nr 112, poz. 654, z późn. zm.)",{"$f":"0","v":0},{"$f":"0","v":0},{"$f":"0","v":0},{"$f":"0","v":0},{"$f":"0","v":0},{"$f":"0","v":0},{"$f":"0","v":0},{"$f":"0","v":0},{"$f":"0","v":0},{"$f":"0","v":0},{"$f":"0","v":0},{"$f":"0","v":0},{"$f":"0","v":0}]
[null,"13.3"," Wysokość zobowiązań podlegających umorzeniu, o którym mowa w art. 190 ustawy o działalności leczniczej","Wysokość zobowiązań podlegających umorzeniu, o którym mowa w art. 190 ustawy o działalności leczniczej",{"$f":"0","v":0},{"$f":"0","v":0},{"$f":"0","v":0},{"$f":"0","v":0},{"$f":"0","v":0},{"$f":"0","v":0},{"$f":"0","v":0},{"$f":"0","v":0},{"$f":"0","v":0},{"$f":"0","v":0},{"$f":"0","v":0},{"$f":"0","v":0},{"$f":"0","v":0}]
[null,"13.4"," Wydatki na spłatę przejętych zobowiązań samodzielnego publicznego zakładu opieki zdrowotnej przekształconego na zasadach określonych w przepisach  o działalności leczniczej","Wydatki na spłatę przejętych zobowiązań samodzielnego publicznego zakładu opieki zdrowotnej przekształconego na zasadach określonych w przepisach  o działalności leczniczej",{"$f":"0","v":0},{"$f":"0","v":0},{"$f":"0","v":0},{"$f":"0","v":0},{"$f":"0","v":0},{"$f":"0","v":0},{"$f":"0","v":0},{"$f":"0","v":0},{"$f":"0","v":0},{"$f":"0","v":0},{"$f":"0","v":0},{"$f":"0","v":0},{"$f":"0","v":0}]
[null,"13.5"," Wydatki na spłatę przejętych zobowiązań samodzielnego publicznego zakładu opieki zdrowotnej likwidowanego na zasadach określonych w przepisach  o działalności leczniczej","Wydatki na spłatę przejętych zobowiązań samodzielnego publicznego zakładu opieki zdrowotnej likwidowanego na zasadach określonych w przepisach  o działalności leczniczej",{"$f":"0","v":0},{"$f":"0","v":0},{"$f":"0","v":0},{"$f":"0","v":0},{"$f":"0","v":0},{"$f":"0","v":0},{"$f":"0","v":0},{"$f":"0","v":0},{"$f":"0","v":0},{"$f":"0","v":0},{"$f":"0","v":0},{"$f":"0","v":0},{"$f":"0","v":0}]
[null,"13.6"," Wydatki na spłatę zobowiązań samodzielnego publicznego zakładu opieki zdrowotnej przejętych do końca 2011 r. na podstawie przepisów o zakładach opieki zdrowotnej","Wydatki na spłatę zobowiązań samodzielnego publicznego zakładu opieki zdrowotnej przejętych do końca 2011 r. na podstawie przepisów o zakładach opieki zdrowotnej",{"$f":"0","v":0},{"$f":"0","v":0},{"$f":"0","v":0},{"$f":"0","v":0},{"$f":"0","v":0},{"$f":"0","v":0},{"$f":"0","v":0},{"$f":"0","v":0},{"$f":"0","v":0},{"$f":"0","v":0},{"$f":"0","v":0},{"$f":"0","v":0},{"$f":"0","v":0}]
[null,"13.7"," Wydatki bieżące na pokrycie ujemnego wyniku finansowego samodzielnego publicznego zakładu opieki zdrowotnej","Wydatki bieżące na pokrycie ujemnego wyniku finansowego samodzielnego publicznego zakładu opieki zdrowotnej",{"$f":"0","v":0},{"$f":"0","v":0},{"$f":"0","v":0},{"$f":"0","v":0},{"$f":"0","v":0},{"$f":"0","v":0},{"$f":"0","v":0},{"$f":"0","v":0},{"$f":"0","v":0},{"$f":"0","v":0},{"$f":"0","v":0},{"$f":"0","v":0},{"$f":"0","v":0}]
["x",14,"Dane uzupełniające o długu i jego spłacie","Dane uzupełniające o długu i jego spłacie","x","x","x","x","x","x","x","x","x","x","x","x","x"]
["x","14.1"," Spłaty rat kapitałowych oraz wykup papierów wartościowych, o których mowa w pkt. 5.1., wynikające wyłącznie z tytułu zobowiązań już zaciągniętych","Spłaty rat kapitałowych oraz wykup papierów wartościowych, o których mowa w pkt. 5.1., wynikające wyłącznie z tytułu zobowiązań już zaciągniętych",{"$f":"4709034.88","v":4709034.88},{"$f":"2026525.28","v":2026525.28},{"$f":"915692","v":915692},{"$f":"915692","v":915692},{"$f":"1215692","v":1215692},{"$f":"1478204","v":1478204},{"$f":"1678204","v":1678204},{"$f":"1860004","v":1860004},{"$f":"2210004","v":2210004},{"$f":"2210004","v":2210004},{"$f":"2250004","v":2250004},{"$f":"2418000","v":2418000},{"$f":"1250000","v":1250000}]
["x","14.2"," Kwota długu, którego planowana spłata dokona się z wydatków budżetu","Kwota długu, którego planowana spłata dokona się z wydatków budżetu",{"$f":"0","v":0},{"$f":"0","v":0},{"$f":"0","v":0},{"$f":"0","v":0},{"$f":"0","v":0},{"$f":"0","v":0},{"$f":"0","v":0},{"$f":"0","v":0},{"$f":"0","v":0},{"$f":"0","v":0},{"$f":"0","v":0},{"$f":"0","v":0},{"$f":"0","v":0}]
["x","14.3"," Wydatki zmniejszające dług, w tym","Wydatki zmniejszające dług, w tym",{"$f":"0","v":0},{"$f":"0","v":0},{"$f":"0","v":0},{"$f":"0","v":0},{"$f":"0","v":0},{"$f":"0","v":0},{"$f":"0","v":0},{"$f":"0","v":0},{"$f":"0","v":0},{"$f":"0","v":0},{"$f":"0","v":0},{"$f":"0","v":0},{"$f":"0","v":0}]
["x","14.3.1","  spłata zobowiązań wymagalnych z lat poprzednich, innych niż w pkt 14.3.3","spłata zobowiązań wymagalnych z lat poprzednich, innych niż w pkt 14.3.3",{"$f":"0","v":0},{"$f":"0","v":0},{"$f":"0","v":0},{"$f":"0","v":0},{"$f":"0","v":0},{"$f":"0","v":0},{"$f":"0","v":0},{"$f":"0","v":0},{"$f":"0","v":0},{"$f":"0","v":0},{"$f":"0","v":0},{"$f":"0","v":0},{"$f":"0","v":0}]
["x","14.3.2","  związane z umowami zaliczanymi do tytułów dłużnych wliczanych do państwowego długu publicznego","związane z umowami zaliczanymi do tytułów dłużnych wliczanych do państwowego długu publicznego",{"$f":"0","v":0},{"$f":"0","v":0},{"$f":"0","v":0},{"$f":"0","v":0},{"$f":"0","v":0},{"$f":"0","v":0},{"$f":"0","v":0},{"$f":"0","v":0},{"$f":"0","v":0},{"$f":"0","v":0},{"$f":"0","v":0},{"$f":"0","v":0},{"$f":"0","v":0}]
["x","14.3.3","  wypłaty z tytułu wymagalnych poręczeń i gwarancji","wypłaty z tytułu wymagalnych poręczeń i gwarancji",{"$f":"0","v":0},{"$f":"0","v":0},{"$f":"0","v":0},{"$f":"0","v":0},{"$f":"0","v":0},{"$f":"0","v":0},{"$f":"0","v":0},{"$f":"0","v":0},{"$f":"0","v":0},{"$f":"0","v":0},{"$f":"0","v":0},{"$f":"0","v":0},{"$f":"0","v":0}]
["x","14.4"," Wynik operacji niekasowych wpływających na kwotę długu ( m.in. umorzenia, różnice kursowe)","Wynik operacji niekasowych wpływających na kwotę długu ( m.in. umorzenia, różnice kursowe)",{"$f":"0","v":0},{"$f":"0","v":0},{"$f":"0","v":0},{"$f":"0","v":0},{"$f":"0","v":0},{"$f":"0","v":0},{"$f":"0","v":0},{"$f":"0","v":0},{"$f":"0","v":0},{"$f":"0","v":0},{"$f":"0","v":0},{"$f":"0","v":0},{"$f":"0","v":0}]
[null,15,"Dane dotyczące emitowanych obligacji przychodowych","Dane dotyczące emitowanych obligacji przychodowych","x","x","x","x","x","x","x","x","x","x","x","x","x"]
[null,"15.1"," Środki z przedsięwzięcia gromadzone na rachunku bankowym,  w tym:","Środki z przedsięwzięcia gromadzone na rachunku bankowym,  w tym:",{"$f":"0","v":0},{"$f":"0","v":0},{"$f":"0","v":0},{"$f":"0","v":0},{"$f":"0","v":0},{"$f":"0","v":0},{"$f":"0","v":0},{"$f":"0","v":0},{"$f":"0","v":0},{"$f":"0","v":0},{"$f":"0","v":0},{"$f":"0","v":0},{"$f":"0","v":0}]
["x","15.1.1","  środki na zaspokojenie roszczeń obligatariuszy","środki na zaspokojenie roszczeń obligatariuszy",{"$f":"0","v":0},{"$f":"0","v":0},{"$f":"0","v":0},{"$f":"0","v":0},{"$f":"0","v":0},{"$f":"0","v":0},{"$f":"0","v":0},{"$f":"0","v":0},{"$f":"0","v":0},{"$f":"0","v":0},{"$f":"0","v":0},{"$f":"0","v":0},{"$f":"0","v":0}]
["x","15.2","Wydatki bieżące z tytułu świadczenia emitenta należnego obligatariuszom,  nieuwzględniane  w limicie spłaty zobowiązań, o którym mowa w art. 243 ustawy","Wydatki bieżące z tytułu świadczenia emitenta należnego obligatariuszom,  nieuwzględniane  w limicie spłaty zobowiązań, o którym mowa w art. 243 ustawy",{"$f":"0","v":0},{"$f":"0","v":0},{"$f":"0","v":0},{"$f":"0","v":0},{"$f":"0","v":0},{"$f":"0","v":0},{"$f":"0","v":0},{"$f":"0","v":0},{"$f":"0","v":0},{"$f":"0","v":0},{"$f":"0","v":0},{"$f":"0","v":0},{"$f":"0","v":0}]
[null,16,null,"Stopień niezachowania relacji określonych w art. 242-244 ustawy \n(dotyczy tylko JST objętych procedurą z art. 240a lub 240b)","x","x","x","x","x","x","x","x","x","x","x","x","x"]
[null,"16.1",null,"Stopień niezachowania relacji zrównoważenia wydatków bieżących, o której mowa w poz. 8.2","x","x","x","x",{"$f":"+IF(I45<0,I45,\"\")","v":""},{"$f":"+IF(J45<0,J45,\"\")","v":""},"","","","","","",""]
["x","16.2",null,"Stopień niezachowania wskaźnika spłaty zobowiązań, o którym mowa w poz. 9.7","x","x","x","x",{"$f":"IF(I50<=I52,\"\",I52- I50)","v":""},{"$f":"IF(J50<=J52,\"\",J52- J50)","v":""},"","","","","","",""]
["x","16.3",null,"Stopień niezachowania wskaźnika spłaty zobowiązań, o którym mowa w poz. 9.7.1","x","x","x","x",{"$f":"IF(I50<=I53,\"\",I53-I50)","v":""},{"$f":"IF(J50<=J53,\"\",J53-J50)","v":""},"","","","","","",""]
[]
[]
[]
[]
[]
[null,"Weryfikacja wybranych danych wykazanych w tabeli Wieloletnia Prognoza Finansowa"]
[null,null,null,"Reguła formalna"]
[null,null,null,"Reguła rachunkowa"]
[null,null,null,"Reguła logiczna"]
[null,null,null,"Reguły kontrolne"]
[null,"[1.1] + [4.1] + [4.2] >= ([2.1] - [2.1.2])","[1.1] + [4.1] + [4.2] >= ([2.1] - [2.1.2])","Spełnienie wskaźnika z art. 242","x","x","x","x",{"$f":"IF(ROUND(I4+I26+I28,2)>=ROUND(I15-I18,2),\"TAK\",\"NIE\")","v":"TAK"},"TAK","TAK","TAK","TAK","TAK","TAK","TAK","TAK"]
[null,"[13.3] = 0 (dla lat 2014 i wyższych)","[13.3] = 0 (dla lat 2014 i wyższych)","Umorzenie zobowiązań, o którym mowa w art. 190 ustawy o działalności leczniczej nie wykracza poza ustawowy okres","x","x","x","x","x","x",{"$f":"IF(K91=0,\"TAK\",\"BŁĄD\")","v":"TAK"},"TAK","TAK","TAK","TAK","TAK","TAK"]
[null,"[1] + [4] - [2] - [5] = 0","[1] + [4] - [2] - [5] = 0","Kontrola poprawności zbilansowania budżetu","x","x","x","x",{"$f":"IF(ROUND(I3+I25-I14-I34,2)=0,\"OK\",ROUND(I3+I25-I14-I34,2))","v":"OK"},"OK","OK","OK","OK","OK","OK","OK","OK"]
[null,"[6]\"n\" = [6]\"n-1\" + [4.3]\"n\" - [5.1]\"n\" +  ([14.2]\"n\"-[14.2]\"n-1\") + [14.4]","[6]\"n\" = [6]\"n-1\" + [4.3]\"n\" - [5.1]\"n\" +  ([14.2]\"n\"-[14.2]\"n-1\") + [14.4]","Kontrola poprawności wyliczenia kwoty długu","x","x","x","x",{"$f":"+IF(ROUND(H41+I30-I35+(I98-H98)+I103-I41,2)=0,\"OK\",ROUND(H41+I30-I35+(I98-H98)+I103-I41,2))","v":"OK"},"OK","OK","OK","OK","OK","OK","OK","OK"]
[null,"[14.2] \"n\" =  ( [14.2]  \"n-1\" -  [14.3] \"n\" ) ","[14.2] \"n\" =  ( [14.2]  \"n-1\" -  [14.3] \"n\" ) ","Analiza zmiany kwoty długu spłacanego wydatkami budżetu \n- wartości różne od zera wymagają objaśnienia \n   - wartości większe od zera wskazują na powstanie w roku prognozy nowego długu tego typu\n   - wartości mniejsze od zera co do zasady nie powinny wystąpić","x","x","x","x",{"$f":"+IF(H98=0,\"N/D\",IF(ROUND(I98+I99-H98,2)=0,\"OK\",ROUND(I98+I99-H98,2)))","v":"N/D"},"N/D","N/D","N/D","N/D","N/D","N/D","N/D","N/D"]
[null,"[13.1] \"n\"  -  ( [13.3] + [13.4] + [13.5] + [13.6] ) \"n\"  =  [13.1] \"n-1\"","[13.1] \"n\"  -  ( [13.3] + [13.4] + [13.5] + [13.6] ) \"n\"  =  [13.1] \"n-1\"","Porównanie na koniec roku prognozy stanu zobowiązań przejętych przez jst po likwidowanych i przekształcanych SP ZOZ z wydatkami i umorzeniami poniesionymi na ten cel ze stanem zobowiązań z okresu N-1","x","x","x","x",{"$f":"+IF(H89=0,\"N/D\",IF(ROUND(I89+(I91+I92+I93+I94)-H89,2)=0,\"OK\",ROUND(I89+(I91+I92+I93+I94)-H89,2)))","v":"N/D"},"N/D","N/D","N/D","N/D","N/D","N/D","N/D","N/D"]
[null,"jeśli [3] < 0 to sprawdź czy [4.1.1] + [4.2.1] + [4.3.1] + [4.4.1] + [3] = 0","jeśli [3] < 0 to sprawdź czy [4.1.1] + [4.2.1] + [4.3.1] + [4.4.1] + [3] = 0","Kontrola poprawności wykazania źródeł pokrycia deficytu","x","x","x","x",{"$f":"IF(I24<0,IF(ROUND(I27+I29+I31+I33+I24,2)=0,\"OK\",ROUND(I27+I29+I31+I33+I24,2)),\"N/D\")","v":"N/D"},"N/D","N/D","N/D","N/D","N/D","N/D","N/D","N/D"]
[null,"jeśli [3] >= 0 to sprawdź czy [4.1.1]=0 i [4.2.1]=0 i [4.3.1]=0 i  [4.4.1] = 0","jeśli [3] >= 0 to sprawdź czy [4.1.1]=0 i [4.2.1]=0 i [4.3.1]=0 i  [4.4.1] = 0","Kontrola poprawności niewykazania źródeł pokrycia deficytu przy nadwyżce budżetu","x","x","x","x",{"$f":"IF(I24>=0,IF(ROUND(I27+I29+I31+I33,2)=0,\"OK\",ROUND(I27+I29+I31+I33,2)),\"N/D\")","v":"OK"},"OK","OK","OK","OK","OK","OK","OK","OK"]
[null,"[1.1.3] >=  [1.1.3.1]","[1.1.3] >=  [1.1.3.1]","Reguła logiczna:  [1.1.3] >=  [1.1.3.1]","x","x","x","x",{"$f":"IF(I7>=I8,\"OK\",\"BŁĄD\")","v":"OK"},"OK","OK","OK","OK","OK","OK","OK","OK"]
[null,"[1.1.5] >= [13.2]","[1.1.5] >= [13.2]","Reguła logiczna:  [1.1.5] >= [13.2]","x","x","x","x",{"$f":"IF(I10>=I90,\"OK\",\"BŁĄD\")","v":"OK"},"OK","OK","OK","OK","OK","OK","OK","OK"]
[null,"[1.1] >=  ([1.1.1] + [1.1.2] + [1.1.3] + [1.1.4] + [1.1.5])","[1.1] >=  ([1.1.1] + [1.1.2] + [1.1.3] + [1.1.4] + [1.1.5])","Reguła logiczna:  [1.1] >=  ([1.1.1] + [1.1.2] + [1.1.3] + [1.1.4] + [1.1.5])","x","x","x","x",{"$f":"IF(I4>=I5+I6+I7+I9+I10,\"OK\",\"BŁĄD\")","v":"OK"},"OK","OK","OK","OK","OK","OK","OK","OK"]
[null,"[1.1] >= [12.1]","[1.1] >= [12.1]","Reguła logiczna:  [1.1] >= [12.1]","x","x","x","x",{"$f":"IF(I4>=I68,\"OK\",\"BŁĄD\")","v":"OK"},"OK","OK","OK","OK","OK","OK","OK","OK"]
[null,"[1.2] >= [1.2.1]","[1.2] >= [1.2.1]","Reguła logiczna:  [1.2] >= [1.2.1]","x","x","x","x",{"$f":"IF(I11>=I12,\"OK\",\"BŁĄD\")","v":"OK"},"OK","OK","OK","OK","OK","OK","OK","OK"]
[null,"[1.2] >= [1.2.2]","[1.2] >= [1.2.2]","Reguła logiczna:  [1.2] >= [1.2.2]","x","x","x","x",{"$f":"IF(I11>=I13,\"OK\",\"BŁĄD\")","v":"OK"},"OK","OK","OK","OK","OK","OK","OK","OK"]
[null,"[1.2] >= [12.2]","[1.2] >= [12.2]","Reguła logiczna:  [1.2] >= [12.2]","x","x","x","x",{"$f":"IF(I11>=I71,\"OK\",\"BŁĄD\")","v":"OK"},"OK","OK","OK","OK","OK","OK","OK","OK"]
[null,null,null,"Reguła logiczna: jeżeli [3] >0 to [10] = [3]","x","x","x","x",{"$f":"+IF(I24>0,IF(I24=I56,\"OK\",\"Błąd\"),\"N/D\")","v":"N/D"},"OK","OK","OK","OK","OK","OK","OK","OK"]
[null,"[10] >= [10.1]","[10] >= [10.1]","Reguła logiczna:  [10] >= [10.1]","x","x","x","x",{"$f":"IF(I56>=I57,\"OK\",\"BŁĄD\")","v":"OK"},"OK","OK","OK","OK","OK","OK","OK","OK"]
[null,null,"jeśli [10] > 0 to powinno być [10.1] > 0","Reguła logiczna:  jeżeli [10] > 0 to [10.1] >0","x","x","x","x",{"$f":"IF(I56>0,IF(I57>0,\"OK\",\"BŁĄD\"),\"N/D\")","v":"N/D"},"OK","OK","OK","OK","OK","OK","OK","OK"]
[null,"[12.1] >= [12.1.1]","[12.1] >= [12.1.1]","Reguła logiczna:  [12.1] >= [12.1.1]","x","x","x","x",{"$f":"IF(I68>=I69,\"OK\",\"BŁĄD\")","v":"OK"},"OK","OK","OK","OK","OK","OK","OK","OK"]
[null,"[12.1.1] >= [12.1.1.1]","[12.1.1] >= [12.1.1.1]","Reguła logiczna:  [12.1.1] >= [12.1.1.1]","x","x","x","x",{"$f":"IF(I69>=I70,\"OK\",\"BŁĄD\")","v":"OK"},"OK","OK","OK","OK","OK","OK","OK","OK"]
[null,"[12.2] >= [12.2.1]","[12.2] >= [12.2.1]","Reguła logiczna:  [12.2] >= [12.2.1]","x","x","x","x",{"$f":"IF(I71>=I72,\"OK\",\"BŁĄD\")","v":"OK"},"OK","OK","OK","OK","OK","OK","OK","OK"]
[null,"[12.2.1] >= [12.2.1.1]","[12.2.1] >= [12.2.1.1]","Reguła logiczna:  [12.2.1] >= [12.2.1.1]","x","x","x","x",{"$f":"IF(I72>=I73,\"OK\",\"BŁĄD\")","v":"OK"},"OK","OK","OK","OK","OK","OK","OK","OK"]
[null,"[12.3] >= [12.3.1]","[12.3] >= [12.3.1]","Reguła logiczna:  [12.3] >= [12.3.1]","x","x","x","x",{"$f":"IF(I74>=I75,\"OK\",\"BŁĄD\")","v":"OK"},"OK","OK","OK","OK","OK","OK","OK","OK"]
[null,"[12.3] >= [12.3.2]","[12.3] >= [12.3.2]","Reguła logiczna:  [12.3] >= [12.3.2]","x","x","x","x",{"$f":"IF(I74>=I76,\"OK\",\"BŁĄD\")","v":"OK"},"OK","OK","OK","OK","OK","OK","OK","OK"]
[null,"[12.4] >= [12.4.1]","[12.4] >= [12.4.1]","Reguła logiczna:  [12.4] >= [12.4.1]","x","x","x","x",{"$f":"IF(I77>=I78,\"OK\",\"BŁĄD\")","v":"OK"},"OK","OK","OK","OK","OK","OK","OK","OK"]
[null,"[12.4] >= [12.4.2]","[12.4] >= [12.4.2]","Reguła logiczna:  [12.4] >= [12.4.2]","x","x","x","x",{"$f":"IF(I77>=I79,\"OK\",\"BŁĄD\")","v":"OK"},"OK","OK","OK","OK","OK","OK","OK","OK"]
[null,"[12.4] >= [12.4.1]","[12.4] >= [12.4.1]","Reguła logiczna:  [12.5] >= [12.5.1]","x","x","x","x",{"$f":"IF(I80>=I81,\"OK\",\"BŁĄD\")","v":"OK"},{"$f":"IF(J80>=J81,\"OK\",\"BŁĄD\")","v":"OK"},"OK","OK","OK","OK","OK","OK","OK"]
[null,"[12.4] >= [12.4.1]","[12.4] >= [12.4.1]","Reguła logiczna:  [12.6] >= [12.6.1]","x","x","x","x",{"$f":"IF(I82>=I83,\"OK\",\"BŁĄD\")","v":"OK"},{"$f":"IF(J82>=J83,\"OK\",\"BŁĄD\")","v":"OK"},"OK","OK","OK","OK","OK","OK","OK"]
[null,"[12.4] >= [12.4.1]","[12.4] >= [12.4.1]","Reguła logiczna:  [12.7] >= [12.7.1]","x","x","x","x",{"$f":"IF(I84>=I85,\"OK\",\"BŁĄD\")","v":"OK"},{"$f":"IF(J84>=J85,\"OK\",\"BŁĄD\")","v":"OK"},"OK","OK","OK","OK","OK","OK","OK"]
[null,"[12.4] >= [12.4.1]","[12.4] >= [12.4.1]","Reguła logiczna:  [12.8] >= [12.8.1]","x","x","x","x",{"$f":"IF(I86>=I87,\"OK\",\"BŁĄD\")","v":"OK"},{"$f":"IF(J86>=J87,\"OK\",\"BŁĄD\")","v":"OK"},"OK","OK","OK","OK","OK","OK","OK"]
[null,"[13.1] >= [13.3]","[13.1] >= [13.3]","Reguła logiczna:  [13.1] >= [13.3]","x","x","x","x",{"$f":"IF(I89>=I91,\"OK\",\"BŁĄD\")","v":"OK"},"OK","OK","OK","OK","OK","OK","OK","OK"]
[null,"[13.4] >= [2.1.2]","[13.4] >= [2.1.2]","Reguła logiczna:  [13.4] >= [2.1.2]","x","x","x","x",{"$f":"IF(I92>=I18,\"OK\",\"BŁĄD\")","v":"OK"},"OK","OK","OK","OK","OK","OK","OK","OK"]
[null,"[14.3] >= [14.3.1] + [14.3.2] + [14.3.3]","[14.3] >= [14.3.1] + [14.3.2] + [14.3.3]","Reguła logiczna:  [14.3] >= [14.3.1] + [14.3.2] + [14.3.3]","x","x","x","x",{"$f":"IF(I99>=(I100+I101+I102),\"OK\",\"BŁĄD\")","v":"OK"},"OK","OK","OK","OK","OK","OK","OK","OK"]
[null,"[13.1] >= [13.3]","[13.1] >= [13.3]","Reguła logiczna:  [15.1] >= [15.1.1]","x","x","x","x",{"$f":"IF(I105>=I106,\"OK\",\"BŁĄD\")","v":"OK"},{"$f":"IF(J105>=J106,\"OK\",\"BŁĄD\")","v":"OK"},"OK","OK","OK","OK","OK","OK","OK"]
[null,"[2.1.1] >= [2.1.1.1]","[2.1.1] >= [2.1.1.1]","Reguła logiczna:  [2.1.1] >= [2.1.1.1]","x","x","x","x",{"$f":"IF(I16>=I17,\"OK\",\"BŁĄD\")","v":"OK"},"OK","OK","OK","OK","OK","OK","OK","OK"]
[null,"[2.1.1] >= [14.3.3]","[2.1.1] >= [14.3.3]","Reguła logiczna:  [2.1.1] >= [14.3.3]","x","x","x","x",{"$f":"IF(I16>=I102,\"OK\",\"BŁĄD\")","v":"OK"},"OK","OK","OK","OK","OK","OK","OK","OK"]
[null,"[2.1.3] >= [2.1.3.1] ","[2.1.3] >= [2.1.3.1] ","Reguła logiczna:  [2.1.3] >= [2.1.3.1] ","x","x","x","x",{"$f":"IF(I19>=I20,\"OK\",\"BŁĄD\")","v":"OK"},"OK","OK","OK","OK","OK","OK","OK","OK"]
[null,"[2.1.3] >= [2.1.3.1] ","[2.1.3] >= [2.1.3.1] ","Reguła logiczna:  [2.1.3.1] >= [2.1.3.1.1]+[2.1.3.1.2] ","x","x","x","x",{"$f":"IF(I20>=(I21+I22),\"OK\",\"BŁĄD\")","v":"OK"},{"$f":"IF(J20>=J21,\"OK\",\"BŁĄD\")","v":"OK"},"OK","OK","OK","OK","OK","OK","OK"]
[null,"[2.1] >= ([2.1.1] + [2.1.2] + [2.1.3])","[2.1] >= ([2.1.1] + [2.1.2] + [2.1.3])","Reguła logiczna:  [2.1] >= ([2.1.1] + [2.1.2] + [2.1.3])","x","x","x","x",{"$f":"IF(I15>=(I16+I18+I19),\"OK\",\"BŁĄD\")","v":"OK"},"OK","OK","OK","OK","OK","OK","OK","OK"]
[null,"[2.1] >= [11.1]","[2.1] >= [11.1]","Reguła logiczna:  [2.1] >= [11.1]","x","x","x","x",{"$f":"IF(I15>=I59,\"OK\",\"BŁĄD\")","v":"OK"},"OK","OK","OK","OK","OK","OK","OK","OK"]
[null,"[2.1] >= [11.3.1]","[2.1] >= [11.3.1]","Reguła logiczna:  [2.1] >= [11.3.1]","x","x","x","x",{"$f":"IF(I15>=I62,\"OK\",\"BŁĄD\")","v":"OK"},"OK","OK","OK","OK","OK","OK","OK","OK"]
[null,"[2.1] >= [12.3]","[2.1] >= [12.3]","Reguła logiczna:  [2.1] >= [12.3]","x","x","x","x",{"$f":"IF(I15>=I74,\"OK\",\"BŁĄD\")","v":"OK"},"OK","OK","OK","OK","OK","OK","OK","OK"]
[null,"[2.1] >= [13.7]","[2.1] >= [13.7]","Reguła logiczna:  [2.1] >= [13.7]","x","x","x","x",{"$f":"IF(I15>=I95,\"OK\",\"BŁĄD\")","v":"OK"},"OK","OK","OK","OK","OK","OK","OK","OK"]
[null,"[2.2] >= [11.3.2]","[2.2] >= [11.3.2]","Reguła logiczna:  [2.2] >= [11.3.2]","x","x","x","x",{"$f":"IF(I23>=I63,\"OK\",\"BŁĄD\")","v":"OK"},"OK","OK","OK","OK","OK","OK","OK","OK"]
[null,"[2.2] >= [11.4] + [11.5]","[2.2] >= [11.4] + [11.5]","Reguła logiczna:  [2.2] >= [11.4] + [11.5]","x","x","x","x",{"$f":"IF(I23>=I64+I65,\"OK\",\"BŁĄD\")","v":"OK"},"OK","OK","OK","OK","OK","OK","OK","OK"]
[null,"[2.2] >= [11.6]","[2.2] >= [11.6]","Reguła logiczna:  [2.2] >= [11.6]","x","x","x","x",{"$f":"IF(I23>=I66,\"OK\",\"BŁĄD\")","v":"OK"},"OK","OK","OK","OK","OK","OK","OK","OK"]
[null,"[2.2] >= [12.4]","[2.2] >= [12.4]","Reguła logiczna:  [2.2] >= [12.4]","x","x","x","x",{"$f":"IF(I23>=I77,\"OK\",\"BŁĄD\")","v":"OK"},"OK","OK","OK","OK","OK","OK","OK","OK"]
[null,"[4.1] >= [4.1.1]","[4.1] >= [4.1.1]","Reguła logiczna:  [4.1] >= [4.1.1]","x","x","x","x",{"$f":"IF(I26>=I27,\"OK\",\"BŁĄD\")","v":"OK"},"OK","OK","OK","OK","OK","OK","OK","OK"]
[null,"[4.2] >= [4.2.1]","[4.2] >= [4.2.1]","Reguła logiczna:  [4.2] >= [4.2.1]","x","x","x","x",{"$f":"IF(I28>=I29,\"OK\",\"BŁĄD\")","v":"OK"},"OK","OK","OK","OK","OK","OK","OK","OK"]
[null,"[4.3] >= [4.3.1]","[4.3] >= [4.3.1]","Reguła logiczna:  [4.3] >= [4.3.1]","x","x","x","x",{"$f":"IF(I30>=I31,\"OK\",\"BŁĄD\")","v":"OK"},"OK","OK","OK","OK","OK","OK","OK","OK"]
[null,"[4.4] >= [4.4.1]","[4.4] >= [4.4.1]","Reguła logiczna:  [4.4] >= [4.4.1]","x","x","x","x",{"$f":"IF(I32>=I33,\"OK\",\"BŁĄD\")","v":"OK"},"OK","OK","OK","OK","OK","OK","OK","OK"]
[null,"[5.1] >= [5.1.1]","[5.1] >= [5.1.1]","Reguła logiczna:  [5.1] >= [5.1.1]","x","x","x","x",{"$f":"IF(I35>=I36,\"OK\",\"BŁĄD\")","v":"OK"},"OK","OK","OK","OK","OK","OK","OK","OK"]
[null,"[5.1] >= [10.1]","[5.1] >= [10.1]","Reguła logiczna:  [5.1] >= [10.1]","x","x","x","x",{"$f":"IF(I35>=I57,\"OK\",\"BŁĄD\")","v":"OK"},"OK","OK","OK","OK","OK","OK","OK","OK"]
[null,"[5.1] >= [14.1]","[5.1] >= [14.1]","Reguła logiczna:  [5.1] >= [14.1]","x","x","x","x",{"$f":"IF(I35>=I97,\"OK\",\"BŁĄD\")","v":"OK"},"OK","OK","OK","OK","OK","OK","OK","OK"]
[null,"[6] >=[7]","[6] >=[7]","Reguła logiczna:  [6] >=[7]","x","x","x","x",{"$f":"IF(I41>=I42,\"OK\",\"BŁĄD\")","v":"OK"},"OK","OK","OK","OK","OK","OK","OK","OK"]
[null,"[6] >= [14.2]","[6] >= [14.2]","Reguła logiczna:  [6] >= [14.2]","x","x","x","x",{"$f":"IF(I41>=I98,\"OK\",\"BŁĄD\")","v":"OK"},"OK","OK","OK","OK","OK","OK","OK","OK"]
[null,"7>=13.1","7>=13.1","Reguła logiczna:  7>=13.1","x","x","x","x",{"$f":"IF(I42>=I89,\"OK\",\"BŁĄD\")","v":"OK"},"OK","OK","OK","OK","OK","OK","OK","OK"]
[null,"jeżeli [2.1.3] <> 0 to  [2.1.3.1] <> 0 ","jeżeli [2.1.3] <> 0 to  [2.1.3.1] <> 0 ","Reguła logiczna:  jeżeli [2.1.3] <> 0 to  [2.1.3.1] <> 0 ","x","x","x","x",{"$f":"IF(I19<>0,IF(I20<>0,\"OK\",\"BŁĄD\"),\"N/D\")","v":"OK"},"OK","OK","OK","OK","OK","OK","OK","OK"]
[]
[null,null,null,"Kontrola poprawności podstawowych kwot"]
[null,null,null,"Dochody ogółem = bieżące + majątkowe",{"$f":"E4+E11","v":36897999.469999999},38775186.080000006,36552514.890000001,36552514.890000001,32174588,33100000,34100000,35100000,36100000,37100000,38100000,39100000,40100000]
[null,null,null,"Wydatki ogółem = bieżące + majątkowe",{"$f":"E15+E23","v":37003938.299999997},37365699.93,42482913.269999996,42482913.269999996,32174588,31621796,32421796,33239996,33889996,34889996,35849996,36682000,36681616]
[null,null,null,"Wynik budżetu = dochody ogółem - wydatki ogółem",{"$f":"E3-E14","v":-105938.82999999821},1409486.1499999985,-5930398.3800000027,-5930398.3800000027,0,1478204,1678204,1860004,2210004,2210004,2250004,2418000,3418384]
[null,null,null,"Wyliczenie kwoty długu","x",{"$f":"E41+F30-F35+(F98-E98)+F103","v":15984842.880000001},"x",{"$f":"F41+H30-H35+(H98-F98)+H103","v":17522808},{"$f":"H41+I30-I35+(I98-H98)+I103","v":17522808},16044604,14366400,12506396,10296392,8086388,5836384,3418384,0]
[null,null,null,"Wyliczenie zobowiązań wynikających z przejęcia przez jst zobowiązań po likwidowanych i przekształcanych SZOZ","x",{"$f":"E89-(F91+F92+F93+F94)","v":0},"x",{"$f":"F89-(H91+H92+H93+H94)","v":0},{"$f":"H89-(I91+I92+I93+I94)","v":0},0,0,0,0,0,0,0,0]
[]
[null,null,null,"Analiza ryzyka niespełnienia wskaźnika z art. 243"]
[null,null,null,"Analiza składowych wzoru wskaźnika z art. 243"]
[null,null,null,0,{"$f":"+\"różnica mniejsza od \"&TEXT(D190*100,\"0,0\")&\"%\"","v":"różnica mniejsza od 0,0%"}]
[null,null,null,5.0000000000000001E-3,{"$f":"+\"różnica mniejsza od \"&TEXT(D191*100,\"0,0\")&\"%\"","v":"różnica mniejsza od 0,5%"}]
[null,null,null,0.01,{"$f":"+\"różnica mniejsza od \"&TEXT(D192*100,\"0,0\")&\"%\"","v":"różnica mniejsza od 1,0%"}]
[null,null,null,"max. limit spłat (planistyczny) - (R+O)/D (bez wyłączeń)","x","x","x","x",{"$f":"+IF(I3=0,\"\",I52-I47)","v":6.9999999999999923E-3},3.9999999999999897E-3,3.600000000000006E-3,1.7899999999999999E-2,2.4500000000000008E-2,3.9999999999999994E-2,5.3900000000000003E-2,6.3499999999999987E-2,5.220000000000001E-2]
[null,null,null,"max. limit spłat (planistyczny) - (R+O)/D (z wyłączeniami)","x","x","x","x",{"$f":"+IF(I3=0,\"\",I52-I48)","v":6.9999999999999923E-3},3.9999999999999897E-3,3.600000000000006E-3,1.7899999999999999E-2,2.4500000000000008E-2,3.9999999999999994E-2,5.3900000000000003E-2,6.3499999999999987E-2,5.220000000000001E-2]
[null,null,null,"max. limit spłat (wg wykonania) - (R+O)/D (bez wyłączeń)","x","x","x","x",{"$f":"+IF(I3=0,\"\",I53-I47)","v":6.9999999999999923E-3},3.9999999999999897E-3,3.600000000000006E-3,1.7899999999999999E-2,2.4500000000000008E-2,3.9999999999999994E-2,5.3900000000000003E-2,6.3499999999999987E-2,5.220000000000001E-2]
[null,null,null,"max. limit spłat (wg wykonania) - (R+O)/D (z wyłączeniami)","x","x","x","x",{"$f":"+IF(I3=0,\"\",I53-I48)","v":6.9999999999999923E-3},3.9999999999999897E-3,3.600000000000006E-3,1.7899999999999999E-2,2.4500000000000008E-2,3.9999999999999994E-2,5.3900000000000003E-2,6.3499999999999987E-2,5.220000000000001E-2]

{"sheet":"WPF_AnalizaWsk_ProjektowanieJST","index":1,"n_rows":203,"n_cols":38,"rows_kept":203,"cut":false,"hidden":true,"merged":[[0,5,0,15],[1,5,1,15],[2,5,2,15],[7,4,7,5]]}
[null,"Raport z systemu BeSTi@ - narzędzie opracowane przez Zespół ds. rozwoju technologii IT przy KR RIO",null,null,null,"Pola z tłem tego koloru są obliczane automatycznie i nie powinny być nadpisywane w celu ochrony formuł"]
[null,"Niniejsze zestawienie można samodzielnie formatować i modyfikować wartości",null,null,null,"Pola z tłem tego koloru są obliczane automatycznie"]
[null,"Układ WPF wg Rozporządzenia Min.Fin. z 10.01.2013 po zmianie z DzU.2013.1736 oraz DzU.2014.1127",null,null,null,"Pola z tłem tego koloru można edytowac wprowadzając nowe wartości (projektowanie WPF i obliczanie wskaźników)"]
[]
[null,"Nr Uchwały:",null,{"$f":"DaneZrodlowe!B4","v":"1/2016"},null,null,null,null,{"$f":"D6&\" - \"&\"WPF za lata \"&D7&\" - Nr Uchwały JST: \"&D5","v":"BRZEZINY - WPF za lata 2016 - 2024 - Nr Uchwały JST: 1/2016"}]
[null,"Nazwa JST:",null,{"$f":"DaneZrodlowe!C4","v":"BRZEZINY"}]
[null,"WPF za lata:",null,{"$f":"CONCATENATE(DaneZrodlowe!N1,\" - \",DaneZrodlowe!Q1)","v":"2016 - 2024"},null,null,null,null,null,"zaokrąglaj wskaźniki procentowe do liczby miejsc po przecinku:",2]
[null,null,null,null,"Wykonanie ",null,"Plan 3 kw.","Wykonanie ",{"$f":"\"\"","v":""}]
["X","Lp.","Formuła","Wyszczególnienie",{"$f":"+F9-1","v":2013},{"$f":"+G9-1","v":2014},{"$f":"+H9","v":2015},{"$f":"+I9-1","v":2015},{"$f":"+DaneZrodlowe!$N$1","v":2016},{"$f":"+I9+1","v":2017},{"$f":"+J9+1","v":2018},2019,2020,2021,2022,2023,2024,2025,2026,2027,2028,2029,2030,2031,2032,2033,2034,2035,2036,2037,2038,2039,2040,2041,2042,2043,2044,2045]
["x",1,"[1.1]+[1.2]","Dochody ogółem",{"$f":"Zał.1_WPF_bazowy!E3","v":36897999.469999999},{"$f":"Zał.1_WPF_bazowy!F3","v":38775186.079999998},{"$f":"Zał.1_WPF_bazowy!G3","v":36552514.890000001},{"$f":"+H11+H18","v":36552514.890000001},{"$f":"+I11+I18","v":32174588},{"$f":"+J11+J18","v":33100000},34100000,35100000,36100000,37100000,38100000,39100000,40100000,{"$error":"#REF!"},{"$error":"#REF!"},{"$error":"#REF!"},{"$error":"#REF!"},{"$error":"#REF!"},{"$error":"#REF!"},{"$error":"#REF!"},{"$error":"#REF!"},{"$error":"#REF!"},{"$error":"#REF!"},{"$error":"#REF!"},{"$error":"#REF!"},{"$error":"#REF!"},{"$error":"#REF!"},{"$error":"#REF!"},{"$error":"#REF!"},{"$error":"#REF!"},{"$error":"#REF!"},{"$error":"#REF!"},{"$error":"#REF!"},{"$error":"#REF!"}]
["x","1.1",null,"Dochody bieżące",{"$f":"Zał.1_WPF_bazowy!E4","v":32301173.260000002},{"$f":"Zał.1_WPF_bazowy!F4","v":34105017.520000003},{"$f":"Zał.1_WPF_bazowy!G4","v":33742971.450000003},{"$f":"Zał.1_WPF_bazowy!H4","v":33742971.450000003},{"$f":"+Zał.1_WPF_bazowy!I4","v":32044588},{"$f":"+Zał.1_WPF_bazowy!J4","v":33100000},{"$f":"+Zał.1_WPF_bazowy!K4","v":34100000},{"$f":"+Zał.1_WPF_bazowy!L4","v":35100000},{"$f":"+Zał.1_WPF_bazowy!M4","v":36100000},{"$f":"+Zał.1_WPF_bazowy!N4","v":37100000},{"$f":"+Zał.1_WPF_bazowy!O4","v":38100000},{"$f":"+Zał.1_WPF_bazowy!P4","v":39100000},{"$f":"+Zał.1_WPF_bazowy!Q4","v":40100000},{"$f":"+Zał.1_WPF_bazowy!#REF!","v":{"$error":"#REF!"}},{"$f":"+Zał.1_WPF_bazowy!#REF!","v":{"$error":"#REF!"}},{"$f":"+Zał.1_WPF_bazowy!#REF!","v":{"$error":"#REF!"}},{"$f":"+Zał.1_WPF_bazowy!#REF!","v":{"$error":"#REF!"}},{"$f":"+Zał.1_WPF_bazowy!#REF!","v":{"$error":"#REF!"}},{"$f":"+Zał.1_WPF_bazowy!#REF!","v":{"$error":"#REF!"}},{"$f":"+Zał.1_WPF_bazowy!#REF!","v":{"$error":"#REF!"}},{"$f":"+Zał.1_WPF_bazowy!#REF!","v":{"$error":"#REF!"}},{"$f":"+Zał.1_WPF_bazowy!#REF!","v":{"$error":"#REF!"}},{"$f":"+Zał.1_WPF_bazowy!#REF!","v":{"$error":"#REF!"}},{"$f":"+Zał.1_WPF_bazowy!#REF!","v":{"$error":"#REF!"}},{"$f":"+Zał.1_WPF_bazowy!#REF!","v":{"$error":"#REF!"}},{"$f":"+Zał.1_WPF_bazowy!#REF!","v":{"$error":"#REF!"}},{"$f":"+Zał.1_WPF_bazowy!#REF!","v":{"$error":"#REF!"}},{"$f":"+Zał.1_WPF_bazowy!#REF!","v":{"$error":"#REF!"}},{"$f":"+Zał.1_WPF_bazowy!#REF!","v":{"$error":"#REF!"}},{"$f":"+Zał.1_WPF_bazowy!#REF!","v":{"$error":"#REF!"}},{"$f":"+Zał.1_WPF_bazowy!#REF!","v":{"$error":"#REF!"}},{"$f":"+Zał.1_WPF_bazowy!#REF!","v":{"$error":"#REF!"}},{"$f":"+Zał.1_WPF_bazowy!#REF!","v":{"$error":"#REF!"}},{"$f":"+Zał.1_WPF_bazowy!#REF!","v":{"$error":"#REF!"}}]
[null,"1.1.1",null,"dochody z tytułu udziału we wpływach z podatku dochodowego od osób fizycznych",{"$f":"Zał.1_WPF_bazowy!E5","v":6476099},{"$f":"Zał.1_WPF_bazowy!F5","v":7136023},{"$f":"Zał.1_WPF_bazowy!G5","v":7700000},{"$f":"Zał.1_WPF_bazowy!H5","v":7700000},{"$f":"+Zał.1_WPF_bazowy!I5","v":8400000},{"$f":"+Zał.1_WPF_bazowy!J5","v":9000000},{"$f":"+Zał.1_WPF_bazowy!K5","v":9500000},{"$f":"+Zał.1_WPF_bazowy!L5","v":10000000},{"$f":"+Zał.1_WPF_bazowy!M5","v":0},{"$f":"+Zał.1_WPF_bazowy!N5","v":0},{"$f":"+Zał.1_WPF_bazowy!O5","v":0},{"$f":"+Zał.1_WPF_bazowy!P5","v":0},{"$f":"+Zał.1_WPF_bazowy!Q5","v":0},{"$f":"+Zał.1_WPF_bazowy!#REF!","v":{"$error":"#REF!"}},{"$f":"+Zał.1_WPF_bazowy!#REF!","v":{"$error":"#REF!"}},{"$f":"+Zał.1_WPF_bazowy!#REF!","v":{"$error":"#REF!"}},{"$f":"+Zał.1_WPF_bazowy!#REF!","v":{"$error":"#REF!"}},{"$f":"+Zał.1_WPF_bazowy!#REF!","v":{"$error":"#REF!"}},{"$f":"+Zał.1_WPF_bazowy!#REF!","v":{"$error":"#REF!"}},{"$f":"+Zał.1_WPF_bazowy!#REF!","v":{"$error":"#REF!"}},{"$f":"+Zał.1_WPF_bazowy!#REF!","v":{"$error":"#REF!"}},{"$f":"+Zał.1_WPF_bazowy!#REF!","v":{"$error":"#REF!"}},{"$f":"+Zał.1_WPF_bazowy!#REF!","v":{"$error":"#REF!"}},{"$f":"+Zał.1_WPF_bazowy!#REF!","v":{"$error":"#REF!"}},{"$f":"+Zał.1_WPF_bazowy!#REF!","v":{"$error":"#REF!"}},{"$f":"+Zał.1_WPF_bazowy!#REF!","v":{"$error":"#REF!"}},{"$f":"+Zał.1_WPF_bazowy!#REF!","v":{"$error":"#REF!"}},{"$f":"+Zał.1_WPF_bazowy!#REF!","v":{"$error":"#REF!"}},{"$f":"+Zał.1_WPF_bazowy!#REF!","v":{"$error":"#REF!"}},{"$f":"+Zał.1_WPF_bazowy!#REF!","v":{"$error":"#REF!"}},{"$f":"+Zał.1_WPF_bazowy!#REF!","v":{"$error":"#REF!"}},{"$f":"+Zał.1_WPF_bazowy!#REF!","v":{"$error":"#REF!"}},{"$f":"+Zał.1_WPF_bazowy!#REF!","v":{"$error":"#REF!"}},{"$f":"+Zał.1_WPF_bazowy!#REF!","v":{"$error":"#REF!"}}]
[null,"1.1.2",null,"dochody z tytułu udziału we wpływach z podatku dochodowego od osób prawnych",{"$f":"Zał.1_WPF_bazowy!E6","v":175600.93},{"$f":"Zał.1_WPF_bazowy!F6","v":175787.56},{"$f":"Zał.1_WPF_bazowy!G6","v":140000},{"$f":"Zał.1_WPF_bazowy!H6","v":140000},{"$f":"+Zał.1_WPF_bazowy!I6","v":140000},{"$f":"+Zał.1_WPF_bazowy!J6","v":140000},{"$f":"+Zał.1_WPF_bazowy!K6","v":140000},{"$f":"+Zał.1_WPF_bazowy!L6","v":140000},{"$f":"+Zał.1_WPF_bazowy!M6","v":0},{"$f":"+Zał.1_WPF_bazowy!N6","v":0},{"$f":"+Zał.1_WPF_bazowy!O6","v":0},{"$f":"+Zał.1_WPF_bazowy!P6","v":0},{"$f":"+Zał.1_WPF_bazowy!Q6","v":0},{"$f":"+Zał.1_WPF_bazowy!#REF!","v":{"$error":"#REF!"}},{"$f":"+Zał.1_WPF_bazowy!#REF!","v":{"$error":"#REF!"}},{"$f":"+Zał.1_WPF_bazowy!#REF!","v":{"$error":"#REF!"}},{"$f":"+Zał.1_WPF_bazowy!#REF!","v":{"$error":"#REF!"}},{"$f":"+Zał.1_WPF_bazowy!#REF!","v":{"$error":"#REF!"}},{"$f":"+Zał.1_WPF_bazowy!#REF!","v":{"$error":"#REF!"}},{"$f":"+Zał.1_WPF_bazowy!#REF!","v":{"$error":"#REF!"}},{"$f":"+Zał.1_WPF_bazowy!#REF!","v":{"$error":"#REF!"}},{"$f":"+Zał.1_WPF_bazowy!#REF!","v":{"$error":"#REF!"}},{"$f":"+Zał.1_WPF_bazowy!#REF!","v":{"$error":"#REF!"}},{"$f":"+Zał.1_WPF_bazowy!#REF!","v":{"$error":"#REF!"}},{"$f":"+Zał.1_WPF_bazowy!#REF!","v":{"$error":"#REF!"}},{"$f":"+Zał.1_WPF_bazowy!#REF!","v":{"$error":"#REF!"}},{"$f":"+Zał.1_WPF_bazowy!#REF!","v":{"$error":"#REF!"}},{"$f":"+Zał.1_WPF_bazowy!#REF!","v":{"$error":"#REF!"}},{"$f":"+Zał.1_WPF_bazowy!#REF!","v":{"$error":"#REF!"}},{"$f":"+Zał.1_WPF_bazowy!#REF!","v":{"$error":"#REF!"}},{"$f":"+Zał.1_WPF_bazowy!#REF!","v":{"$error":"#REF!"}},{"$f":"+Zał.1_WPF_bazowy!#REF!","v":{"$error":"#REF!"}},{"$f":"+Zał.1_WPF_bazowy!#REF!","v":{"$error":"#REF!"}},{"$f":"+Zał.1_WPF_bazowy!#REF!","v":{"$error":"#REF!"}}]
[null,"1.1.3",null,"podatki i opłaty",{"$f":"Zał.1_WPF_bazowy!E7","v":5289523.0199999996},{"$f":"Zał.1_WPF_bazowy!F7","v":7010289.2699999996},{"$f":"Zał.1_WPF_bazowy!G7","v":7628751},{"$f":"Zał.1_WPF_bazowy!H7","v":7628751},{"$f":"+Zał.1_WPF_bazowy!I7","v":7223150},{"$f":"+Zał.1_WPF_bazowy!J7","v":7300000},{"$f":"+Zał.1_WPF_bazowy!K7","v":7400000},{"$f":"+Zał.1_WPF_bazowy!L7","v":7500000},{"$f":"+Zał.1_WPF_bazowy!M7","v":0},{"$f":"+Zał.1_WPF_bazowy!N7","v":0},{"$f":"+Zał.1_WPF_bazowy!O7","v":0},{"$f":"+Zał.1_WPF_bazowy!P7","v":0},{"$f":"+Zał.1_WPF_bazowy!Q7","v":0},{"$f":"+Zał.1_WPF_bazowy!#REF!","v":{"$error":"#REF!"}},{"$f":"+Zał.1_WPF_bazowy!#REF!","v":{"$error":"#REF!"}},{"$f":"+Zał.1_WPF_bazowy!#REF!","v":{"$error":"#REF!"}},{"$f":"+Zał.1_WPF_bazowy!#REF!","v":{"$error":"#REF!"}},{"$f":"+Zał.1_WPF_bazowy!#REF!","v":{"$error":"#REF!"}},{"$f":"+Zał.1_WPF_bazowy!#REF!","v":{"$error":"#REF!"}},{"$f":"+Zał.1_WPF_bazowy!#REF!","v":{"$error":"#REF!"}},{"$f":"+Zał.1_WPF_bazowy!#REF!","v":{"$error":"#REF!"}},{"$f":"+Zał.1_WPF_bazowy!#REF!","v":{"$error":"#REF!"}},{"$f":"+Zał.1_WPF_bazowy!#REF!","v":{"$error":"#REF!"}},{"$f":"+Zał.1_WPF_bazowy!#REF!","v":{"$error":"#REF!"}},{"$f":"+Zał.1_WPF_bazowy!#REF!","v":{"$error":"#REF!"}},{"$f":"+Zał.1_WPF_bazowy!#REF!","v":{"$error":"#REF!"}},{"$f":"+Zał.1_WPF_bazowy!#REF!","v":{"$error":"#REF!"}},{"$f":"+Zał.1_WPF_bazowy!#REF!","v":{"$error":"#REF!"}},{"$f":"+Zał.1_WPF_bazowy!#REF!","v":{"$error":"#REF!"}},{"$f":"+Zał.1_WPF_bazowy!#REF!","v":{"$error":"#REF!"}},{"$f":"+Zał.1_WPF_bazowy!#REF!","v":{"$error":"#REF!"}},{"$f":"+Zał.1_WPF_bazowy!#REF!","v":{"$error":"#REF!"}},{"$f":"+Zał.1_WPF_bazowy!#REF!","v":{"$error":"#REF!"}},{"$f":"+Zał.1_WPF_bazowy!#REF!","v":{"$error":"#REF!"}}]
[null,"1.1.3.1",null,"z podatku od nieruchomości",{"$f":"Zał.1_WPF_bazowy!E8","v":3824840.21},{"$f":"Zał.1_WPF_bazowy!F8","v":4237030.5},{"$f":"Zał.1_WPF_bazowy!G8","v":4769505},{"$f":"Zał.1_WPF_bazowy!H8","v":4769505},{"$f":"+Zał.1_WPF_bazowy!I8","v":4400000},{"$f":"+Zał.1_WPF_bazowy!J8","v":4500000},{"$f":"+Zał.1_WPF_bazowy!K8","v":4600000},{"$f":"+Zał.1_WPF_bazowy!L8","v":4700000},{"$f":"+Zał.1_WPF_bazowy!M8","v":0},{"$f":"+Zał.1_WPF_bazowy!N8","v":0},{"$f":"+Zał.1_WPF_bazowy!O8","v":0},{"$f":"+Zał.1_WPF_bazowy!P8","v":0},{"$f":"+Zał.1_WPF_bazowy!Q8","v":0},{"$f":"+Zał.1_WPF_bazowy!#REF!","v":{"$error":"#REF!"}},{"$f":"+Zał.1_WPF_bazowy!#REF!","v":{"$error":"#REF!"}},{"$f":"+Zał.1_WPF_bazowy!#REF!","v":{"$error":"#REF!"}},{"$f":"+Zał.1_WPF_bazowy!#REF!","v":{"$error":"#REF!"}},{"$f":"+Zał.1_WPF_bazowy!#REF!","v":{"$error":"#REF!"}},{"$f":"+Zał.1_WPF_bazowy!#REF!","v":{"$error":"#REF!"}},{"$f":"+Zał.1_WPF_bazowy!#REF!","v":{"$error":"#REF!"}},{"$f":"+Zał.1_WPF_bazowy!#REF!","v":{"$error":"#REF!"}},{"$f":"+Zał.1_WPF_bazowy!#REF!","v":{"$error":"#REF!"}},{"$f":"+Zał.1_WPF_bazowy!#REF!","v":{"$error":"#REF!"}},{"$f":"+Zał.1_WPF_bazowy!#REF!","v":{"$error":"#REF!"}},{"$f":"+Zał.1_WPF_bazowy!#REF!","v":{"$error":"#REF!"}},{"$f":"+Zał.1_WPF_bazowy!#REF!","v":{"$error":"#REF!"}},{"$f":"+Zał.1_WPF_bazowy!#REF!","v":{"$error":"#REF!"}},{"$f":"+Zał.1_WPF_bazowy!#REF!","v":{"$error":"#REF!"}},{"$f":"+Zał.1_WPF_bazowy!#REF!","v":{"$error":"#REF!"}},{"$f":"+Zał.1_WPF_bazowy!#REF!","v":{"$error":"#REF!"}},{"$f":"+Zał.1_WPF_bazowy!#REF!","v":{"$error":"#REF!"}},{"$f":"+Zał.1_WPF_bazowy!#REF!","v":{"$error":"#REF!"}},{"$f":"+Zał.1_WPF_bazowy!#REF!","v":{"$error":"#REF!"}},{"$f":"+Zał.1_WPF_bazowy!#REF!","v":{"$error":"#REF!"}}]
[null,"1.1.4",null,"z subwencji ogólnej",{"$f":"Zał.1_WPF_bazowy!E9","v":7466452},{"$f":"Zał.1_WPF_bazowy!F9","v":8308307},{"$f":"Zał.1_WPF_bazowy!G9","v":9112541},{"$f":"Zał.1_WPF_bazowy!H9","v":9112541},{"$f":"+Zał.1_WPF_bazowy!I9","v":9238483},{"$f":"+Zał.1_WPF_bazowy!J9","v":9300000},{"$f":"+Zał.1_WPF_bazowy!K9","v":9400000},{"$f":"+Zał.1_WPF_bazowy!L9","v":9500000},{"$f":"+Zał.1_WPF_bazowy!M9","v":0},{"$f":"+Zał.1_WPF_bazowy!N9","v":0},{"$f":"+Zał.1_WPF_bazowy!O9","v":0},{"$f":"+Zał.1_WPF_bazowy!P9","v":0},{"$f":"+Zał.1_WPF_bazowy!Q9","v":0},{"$f":"+Zał.1_WPF_bazowy!#REF!","v":{"$error":"#REF!"}},{"$f":"+Zał.1_WPF_bazowy!#REF!","v":{"$error":"#REF!"}},{"$f":"+Zał.1_WPF_bazowy!#REF!","v":{"$error":"#REF!"}},{"$f":"+Zał.1_WPF_bazowy!#REF!","v":{"$error":"#REF!"}},{"$f":"+Zał.1_WPF_bazowy!#REF!","v":{"$error":"#REF!"}},{"$f":"+Zał.1_WPF_bazowy!#REF!","v":{"$error":"#REF!"}},{"$f":"+Zał.1_WPF_bazowy!#REF!","v":{"$error":"#REF!"}},{"$f":"+Zał.1_WPF_bazowy!#REF!","v":{"$error":"#REF!"}},{"$f":"+Zał.1_WPF_bazowy!#REF!","v":{"$error":"#REF!"}},{"$f":"+Zał.1_WPF_bazowy!#REF!","v":{"$error":"#REF!"}},{"$f":"+Zał.1_WPF_bazowy!#REF!","v":{"$error":"#REF!"}},{"$f":"+Zał.1_WPF_bazowy!#REF!","v":{"$error":"#REF!"}},{"$f":"+Zał.1_WPF_bazowy!#REF!","v":{"$error":"#REF!"}},{"$f":"+Zał.1_WPF_bazowy!#REF!","v":{"$error":"#REF!"}},{"$f":"+Zał.1_WPF_bazowy!#REF!","v":{"$error":"#REF!"}},{"$f":"+Zał.1_WPF_bazowy!#REF!","v":{"$error":"#REF!"}},{"$f":"+Zał.1_WPF_bazowy!#REF!","v":{"$error":"#REF!"}},{"$f":"+Zał.1_WPF_bazowy!#REF!","v":{"$error":"#REF!"}},{"$f":"+Zał.1_WPF_bazowy!#REF!","v":{"$error":"#REF!"}},{"$f":"+Zał.1_WPF_bazowy!#REF!","v":{"$error":"#REF!"}},{"$f":"+Zał.1_WPF_bazowy!#REF!","v":{"$error":"#REF!"}}]
[null,"1.1.5",null,"z tytułu dotacji i środków przeznaczonych na cele bieżące",{"$f":"Zał.1_WPF_bazowy!E10","v":8685748.0500000007},{"$f":"Zał.1_WPF_bazowy!F10","v":8330252.4299999997},{"$f":"Zał.1_WPF_bazowy!G10","v":6570203.4500000002},{"$f":"Zał.1_WPF_bazowy!H10","v":6570203.4500000002},{"$f":"+Zał.1_WPF_bazowy!I10","v":5085967},{"$f":"+Zał.1_WPF_bazowy!J10","v":5100000},{"$f":"+Zał.1_WPF_bazowy!K10","v":5200000},{"$f":"+Zał.1_WPF_bazowy!L10","v":5300000},{"$f":"+Zał.1_WPF_bazowy!M10","v":0},{"$f":"+Zał.1_WPF_bazowy!N10","v":0},{"$f":"+Zał.1_WPF_bazowy!O10","v":0},{"$f":"+Zał.1_WPF_bazowy!P10","v":0},{"$f":"+Zał.1_WPF_bazowy!Q10","v":0},{"$f":"+Zał.1_WPF_bazowy!#REF!","v":{"$error":"#REF!"}},{"$f":"+Zał.1_WPF_bazowy!#REF!","v":{"$error":"#REF!"}},{"$f":"+Zał.1_WPF_bazowy!#REF!","v":{"$error":"#REF!"}},{"$f":"+Zał.1_WPF_bazowy!#REF!","v":{"$error":"#REF!"}},{"$f":"+Zał.1_WPF_bazowy!#REF!","v":{"$error":"#REF!"}},{"$f":"+Zał.1_WPF_bazowy!#REF!","v":{"$error":"#REF!"}},{"$f":"+Zał.1_WPF_bazowy!#REF!","v":{"$error":"#REF!"}},{"$f":"+Zał.1_WPF_bazowy!#REF!","v":{"$error":"#REF!"}},{"$f":"+Zał.1_WPF_bazowy!#REF!","v":{"$error":"#REF!"}},{"$f":"+Zał.1_WPF_bazowy!#REF!","v":{"$error":"#REF!"}},{"$f":"+Zał.1_WPF_bazowy!#REF!","v":{"$error":"#REF!"}},{"$f":"+Zał.1_WPF_bazowy!#REF!","v":{"$error":"#REF!"}},{"$f":"+Zał.1_WPF_bazowy!#REF!","v":{"$error":"#REF!"}},{"$f":"+Zał.1_WPF_bazowy!#REF!","v":{"$error":"#REF!"}},{"$f":"+Zał.1_WPF_bazowy!#REF!","v":{"$error":"#REF!"}},{"$f":"+Zał.1_WPF_bazowy!#REF!","v":{"$error":"#REF!"}},{"$f":"+Zał.1_WPF_bazowy!#REF!","v":{"$error":"#REF!"}},{"$f":"+Zał.1_WPF_bazowy!#REF!","v":{"$error":"#REF!"}},{"$f":"+Zał.1_WPF_bazowy!#REF!","v":{"$error":"#REF!"}},{"$f":"+Zał.1_WPF_bazowy!#REF!","v":{"$error":"#REF!"}},{"$f":"+Zał.1_WPF_bazowy!#REF!","v":{"$error":"#REF!"}}]
["x","1.2",null,"Dochody majątkowe, w tym",{"$f":"Zał.1_WPF_bazowy!E11","v":4596826.21},{"$f":"Zał.1_WPF_bazowy!F11","v":4670168.5599999996},{"$f":"Zał.1_WPF_bazowy!G11","v":2809543.44},{"$f":"Zał.1_WPF_bazowy!H11","v":2809543.44},{"$f":"+Zał.1_WPF_bazowy!I11","v":130000},{"$f":"+Zał.1_WPF_bazowy!J11","v":0},{"$f":"+Zał.1_WPF_bazowy!K11","v":0},{"$f":"+Zał.1_WPF_bazowy!L11","v":0},{"$f":"+Zał.1_WPF_bazowy!M11","v":0},{"$f":"+Zał.1_WPF_bazowy!N11","v":0},{"$f":"+Zał.1_WPF_bazowy!O11","v":0},{"$f":"+Zał.1_WPF_bazowy!P11","v":0},{"$f":"+Zał.1_WPF_bazowy!Q11","v":0},{"$f":"+Zał.1_WPF_bazowy!#REF!","v":{"$error":"#REF!"}},{"$f":"+Zał.1_WPF_bazowy!#REF!","v":{"$error":"#REF!"}},{"$f":"+Zał.1_WPF_bazowy!#REF!","v":{"$error":"#REF!"}},{"$f":"+Zał.1_WPF_bazowy!#REF!","v":{"$error":"#REF!"}},{"$f":"+Zał.1_WPF_bazowy!#REF!","v":{"$error":"#REF!"}},{"$f":"+Zał.1_WPF_bazowy!#REF!","v":{"$error":"#REF!"}},{"$f":"+Zał.1_WPF_bazowy!#REF!","v":{"$error":"#REF!"}},{"$f":"+Zał.1_WPF_bazowy!#REF!","v":{"$error":"#REF!"}},{"$f":"+Zał.1_WPF_bazowy!#REF!","v":{"$error":"#REF!"}},{"$f":"+Zał.1_WPF_bazowy!#REF!","v":{"$error":"#REF!"}},{"$f":"+Zał.1_WPF_bazowy!#REF!","v":{"$error":"#REF!"}},{"$f":"+Zał.1_WPF_bazowy!#REF!","v":{"$error":"#REF!"}},{"$f":"+Zał.1_WPF_bazowy!#REF!","v":{"$error":"#REF!"}},{"$f":"+Zał.1_WPF_bazowy!#REF!","v":{"$error":"#REF!"}},{"$f":"+Zał.1_WPF_bazowy!#REF!","v":{"$error":"#REF!"}},{"$f":"+Zał.1_WPF_bazowy!#REF!","v":{"$error":"#REF!"}},{"$f":"+Zał.1_WPF_bazowy!#REF!","v":{"$error":"#REF!"}},{"$f":"+Zał.1_WPF_bazowy!#REF!","v":{"$error":"#REF!"}},{"$f":"+Zał.1_WPF_bazowy!#REF!","v":{"$error":"#REF!"}},{"$f":"+Zał.1_WPF_bazowy!#REF!","v":{"$error":"#REF!"}},{"$f":"+Zał.1_WPF_bazowy!#REF!","v":{"$error":"#REF!"}}]
["x","1.2.1",null,"ze sprzedaży majątku",{"$f":"Zał.1_WPF_bazowy!E12","v":198768.84},{"$f":"Zał.1_WPF_bazowy!F12","v":243965.6},{"$f":"Zał.1_WPF_bazowy!G12","v":21000},{"$f":"Zał.1_WPF_bazowy!H12","v":21000},{"$f":"+Zał.1_WPF_bazowy!I12","v":120000},{"$f":"+Zał.1_WPF_bazowy!J12","v":0},{"$f":"+Zał.1_WPF_bazowy!K12","v":0},{"$f":"+Zał.1_WPF_bazowy!L12","v":0},{"$f":"+Zał.1_WPF_bazowy!M12","v":0},{"$f":"+Zał.1_WPF_bazowy!N12","v":0},{"$f":"+Zał.1_WPF_bazowy!O12","v":0},{"$f":"+Zał.1_WPF_bazowy!P12","v":0},{"$f":"+Zał.1_WPF_bazowy!Q12","v":0},{"$f":"+Zał.1_WPF_bazowy!#REF!","v":{"$error":"#REF!"}},{"$f":"+Zał.1_WPF_bazowy!#REF!","v":{"$error":"#REF!"}},{"$f":"+Zał.1_WPF_bazowy!#REF!","v":{"$error":"#REF!"}},{"$f":"+Zał.1_WPF_bazowy!#REF!","v":{"$error":"#REF!"}},{"$f":"+Zał.1_WPF_bazowy!#REF!","v":{"$error":"#REF!"}},{"$f":"+Zał.1_WPF_bazowy!#REF!","v":{"$error":"#REF!"}},{"$f":"+Zał.1_WPF_bazowy!#REF!","v":{"$error":"#REF!"}},{"$f":"+Zał.1_WPF_bazowy!#REF!","v":{"$error":"#REF!"}},{"$f":"+Zał.1_WPF_bazowy!#REF!","v":{"$error":"#REF!"}},{"$f":"+Zał.1_WPF_bazowy!#REF!","v":{"$error":"#REF!"}},{"$f":"+Zał.1_WPF_bazowy!#REF!","v":{"$error":"#REF!"}},{"$f":"+Zał.1_WPF_bazowy!#REF!","v":{"$error":"#REF!"}},{"$f":"+Zał.1_WPF_bazowy!#REF!","v":{"$error":"#REF!"}},{"$f":"+Zał.1_WPF_bazowy!#REF!","v":{"$error":"#REF!"}},{"$f":"+Zał.1_WPF_bazowy!#REF!","v":{"$error":"#REF!"}},{"$f":"+Zał.1_WPF_bazowy!#REF!","v":{"$error":"#REF!"}},{"$f":"+Zał.1_WPF_bazowy!#REF!","v":{"$error":"#REF!"}},{"$f":"+Zał.1_WPF_bazowy!#REF!","v":{"$error":"#REF!"}},{"$f":"+Zał.1_WPF_bazowy!#REF!","v":{"$error":"#REF!"}},{"$f":"+Zał.1_WPF_bazowy!#REF!","v":{"$error":"#REF!"}},{"$f":"+Zał.1_WPF_bazowy!#REF!","v":{"$error":"#REF!"}}]
[null,"1.2.2",null,"z tytułu dotacji oraz środków przeznaczonych na inwestycje",{"$f":"Zał.1_WPF_bazowy!E13","v":4223796.09},{"$f":"Zał.1_WPF_bazowy!F13","v":4326916.96},{"$f":"Zał.1_WPF_bazowy!G13","v":2773543.44},{"$f":"Zał.1_WPF_bazowy!H13","v":2773543.44},{"$f":"+Zał.1_WPF_bazowy!I13","v":0},{"$f":"+Zał.1_WPF_bazowy!J13","v":0},{"$f":"+Zał.1_WPF_bazowy!K13","v":0},{"$f":"+Zał.1_WPF_bazowy!L13","v":0},{"$f":"+Zał.1_WPF_bazowy!M13","v":0},{"$f":"+Zał.1_WPF_bazowy!N13","v":0},{"$f":"+Zał.1_WPF_bazowy!O13","v":0},{"$f":"+Zał.1_WPF_bazowy!P13","v":0},{"$f":"+Zał.1_WPF_bazowy!Q13","v":0},{"$f":"+Zał.1_WPF_bazowy!#REF!","v":{"$error":"#REF!"}},{"$f":"+Zał.1_WPF_bazowy!#REF!","v":{"$error":"#REF!"}},{"$f":"+Zał.1_WPF_bazowy!#REF!","v":{"$error":"#REF!"}},{"$f":"+Zał.1_WPF_bazowy!#REF!","v":{"$error":"#REF!"}},{"$f":"+Zał.1_WPF_bazowy!#REF!","v":{"$error":"#REF!"}},{"$f":"+Zał.1_WPF_bazowy!#REF!","v":{"$error":"#REF!"}},{"$f":"+Zał.1_WPF_bazowy!#REF!","v":{"$error":"#REF!"}},{"$f":"+Zał.1_WPF_bazowy!#REF!","v":{"$error":"#REF!"}},{"$f":"+Zał.1_WPF_bazowy!#REF!","v":{"$error":"#REF!"}},{"$f":"+Zał.1_WPF_bazowy!#REF!","v":{"$error":"#REF!"}},{"$f":"+Zał.1_WPF_bazowy!#REF!","v":{"$error":"#REF!"}},{"$f":"+Zał.1_WPF_bazowy!#REF!","v":{"$error":"#REF!"}},{"$f":"+Zał.1_WPF_bazowy!#REF!","v":{"$error":"#REF!"}},{"$f":"+Zał.1_WPF_bazowy!#REF!","v":{"$error":"#REF!"}},{"$f":"+Zał.1_WPF_bazowy!#REF!","v":{"$error":"#REF!"}},{"$f":"+Zał.1_WPF_bazowy!#REF!","v":{"$error":"#REF!"}},{"$f":"+Zał.1_WPF_bazowy!#REF!","v":{"$error":"#REF!"}},{"$f":"+Zał.1_WPF_bazowy!#REF!","v":{"$error":"#REF!"}},{"$f":"+Zał.1_WPF_bazowy!#REF!","v":{"$error":"#REF!"}},{"$f":"+Zał.1_WPF_bazowy!#REF!","v":{"$error":"#REF!"}},{"$f":"+Zał.1_WPF_bazowy!#REF!","v":{"$error":"#REF!"}}]
["x",2,"[2.1]+[2.2]","Wydatki ogółem",{"$f":"Zał.1_WPF_bazowy!E14","v":37003938.299999997},{"$f":"Zał.1_WPF_bazowy!F14","v":37365699.93},{"$f":"Zał.1_WPF_bazowy!G14","v":42482913.270000003},{"$f":"+H22+H30","v":42482913.269999996},{"$f":"+I22+I30","v":32174588},{"$f":"+J22+J30","v":31621796},32421796,33239996,33889996,34889996,35849996,36682000,36681616,{"$error":"#REF!"},{"$error":"#REF!"},{"$error":"#REF!"},{"$error":"#REF!"},{"$error":"#REF!"},{"$error":"#REF!"},{"$error":"#REF!"},{"$error":"#REF!"},{"$error":"#REF!"},{"$error":"#REF!"},{"$error":"#REF!"},{"$error":"#REF!"},{"$error":"#REF!"},{"$error":"#REF!"},{"$error":"#REF!"},{"$error":"#REF!"},{"$error":"#REF!"},{"$error":"#REF!"},{"$error":"#REF!"},{"$error":"#REF!"},{"$error":"#REF!"}]
["x","2.1",null,"Wydatki bieżące, w tym:",{"$f":"Zał.1_WPF_bazowy!E15","v":30174248.699999999},{"$f":"Zał.1_WPF_bazowy!F15","v":31284204.73},{"$f":"Zał.1_WPF_bazowy!G15","v":31963540.27},{"$f":"Zał.1_WPF_bazowy!H15","v":31963540.27},{"$f":"+Zał.1_WPF_bazowy!I15","v":29810588},{"$f":"+Zał.1_WPF_bazowy!J15","v":30200000},{"$f":"+Zał.1_WPF_bazowy!K15","v":30700000},{"$f":"+Zał.1_WPF_bazowy!L15","v":31200000},{"$f":"+Zał.1_WPF_bazowy!M15","v":31700000},{"$f":"+Zał.1_WPF_bazowy!N15","v":32200000},{"$f":"+Zał.1_WPF_bazowy!O15","v":32700000},{"$f":"+Zał.1_WPF_bazowy!P15","v":33200000},{"$f":"+Zał.1_WPF_bazowy!Q15","v":33700000},{"$f":"+Zał.1_WPF_bazowy!#REF!","v":{"$error":"#REF!"}},{"$f":"+Zał.1_WPF_bazowy!#REF!","v":{"$error":"#REF!"}},{"$f":"+Zał.1_WPF_bazowy!#REF!","v":{"$error":"#REF!"}},{"$f":"+Zał.1_WPF_bazowy!#REF!","v":{"$error":"#REF!"}},{"$f":"+Zał.1_WPF_bazowy!#REF!","v":{"$error":"#REF!"}},{"$f":"+Zał.1_WPF_bazowy!#REF!","v":{"$error":"#REF!"}},{"$f":"+Zał.1_WPF_bazowy!#REF!","v":{"$error":"#REF!"}},{"$f":"+Zał.1_WPF_bazowy!#REF!","v":{"$error":"#REF!"}},{"$f":"+Zał.1_WPF_bazowy!#REF!","v":{"$error":"#REF!"}},{"$f":"+Zał.1_WPF_bazowy!#REF!","v":{"$error":"#REF!"}},{"$f":"+Zał.1_WPF_bazowy!#REF!","v":{"$error":"#REF!"}},{"$f":"+Zał.1_WPF_bazowy!#REF!","v":{"$error":"#REF!"}},{"$f":"+Zał.1_WPF_bazowy!#REF!","v":{"$error":"#REF!"}},{"$f":"+Zał.1_WPF_bazowy!#REF!","v":{"$error":"#REF!"}},{"$f":"+Zał.1_WPF_bazowy!#REF!","v":{"$error":"#REF!"}},{"$f":"+Zał.1_WPF_bazowy!#REF!","v":{"$error":"#REF!"}},{"$f":"+Zał.1_WPF_bazowy!#REF!","v":{"$error":"#REF!"}},{"$f":"+Zał.1_WPF_bazowy!#REF!","v":{"$error":"#REF!"}},{"$f":"+Zał.1_WPF_bazowy!#REF!","v":{"$error":"#REF!"}},{"$f":"+Zał.1_WPF_bazowy!#REF!","v":{"$error":"#REF!"}},{"$f":"+Zał.1_WPF_bazowy!#REF!","v":{"$error":"#REF!"}}]
["x","2.1.1",null,"z tytułu poręczeń i gwarancji",{"$f":"Zał.1_WPF_bazowy!E16","v":0},{"$f":"Zał.1_WPF_bazowy!F16","v":0},{"$f":"Zał.1_WPF_bazowy!G16","v":28000},{"$f":"Zał.1_WPF_bazowy!H16","v":28000},{"$f":"+Zał.1_WPF_bazowy!I16","v":113000},{"$f":"+Zał.1_WPF_bazowy!J16","v":114000},{"$f":"+Zał.1_WPF_bazowy!K16","v":116000},{"$f":"+Zał.1_WPF_bazowy!L16","v":117000},{"$f":"+Zał.1_WPF_bazowy!M16","v":119000},{"$f":"+Zał.1_WPF_bazowy!N16","v":121000},{"$f":"+Zał.1_WPF_bazowy!O16","v":123000},{"$f":"+Zał.1_WPF_bazowy!P16","v":126000},{"$f":"+Zał.1_WPF_bazowy!Q16","v":128000},{"$f":"+Zał.1_WPF_bazowy!#REF!","v":{"$error":"#REF!"}},{"$f":"+Zał.1_WPF_bazowy!#REF!","v":{"$error":"#REF!"}},{"$f":"+Zał.1_WPF_bazowy!#REF!","v":{"$error":"#REF!"}},{"$f":"+Zał.1_WPF_bazowy!#REF!","v":{"$error":"#REF!"}},{"$f":"+Zał.1_WPF_bazowy!#REF!","v":{"$error":"#REF!"}},{"$f":"+Zał.1_WPF_bazowy!#REF!","v":{"$error":"#REF!"}},{"$f":"+Zał.1_WPF_bazowy!#REF!","v":{"$error":"#REF!"}},{"$f":"+Zał.1_WPF_bazowy!#REF!","v":{"$error":"#REF!"}},{"$f":"+Zał.1_WPF_bazowy!#REF!","v":{"$error":"#REF!"}},{"$f":"+Zał.1_WPF_bazowy!#REF!","v":{"$error":"#REF!"}},{"$f":"+Zał.1_WPF_bazowy!#REF!","v":{"$error":"#REF!"}},{"$f":"+Zał.1_WPF_bazowy!#REF!","v":{"$error":"#REF!"}},{"$f":"+Zał.1_WPF_bazowy!#REF!","v":{"$error":"#REF!"}},{"$f":"+Zał.1_WPF_bazowy!#REF!","v":{"$error":"#REF!"}},{"$f":"+Zał.1_WPF_bazowy!#REF!","v":{"$error":"#REF!"}},{"$f":"+Zał.1_WPF_bazowy!#REF!","v":{"$error":"#REF!"}},{"$f":"+Zał.1_WPF_bazowy!#REF!","v":{"$error":"#REF!"}},{"$f":"+Zał.1_WPF_bazowy!#REF!","v":{"$error":"#REF!"}},{"$f":"+Zał.1_WPF_bazowy!#REF!","v":{"$error":"#REF!"}},{"$f":"+Zał.1_WPF_bazowy!#REF!","v":{"$error":"#REF!"}},{"$f":"+Zał.1_WPF_bazowy!#REF!","v":{"$error":"#REF!"}}]
["x","2.1.1.1",null,"w tym: gwarancje i poręczenia podlegające wyłączeniu z limitu spłaty zobowiązań, o którym mowa w art. 243 ustawy",{"$f":"Zał.1_WPF_bazowy!E17","v":0},{"$f":"Zał.1_WPF_bazowy!F17","v":0},{"$f":"Zał.1_WPF_bazowy!G17","v":0},{"$f":"Zał.1_WPF_bazowy!H17","v":0},{"$f":"+Zał.1_WPF_bazowy!I17","v":0},{"$f":"+Zał.1_WPF_bazowy!J17","v":0},{"$f":"+Zał.1_WPF_bazowy!K17","v":0},{"$f":"+Zał.1_WPF_bazowy!L17","v":0},{"$f":"+Zał.1_WPF_bazowy!M17","v":0},{"$f":"+Zał.1_WPF_bazowy!N17","v":0},{"$f":"+Zał.1_WPF_bazowy!O17","v":0},{"$f":"+Zał.1_WPF_bazowy!P17","v":0},{"$f":"+Zał.1_WPF_bazowy!Q17","v":0},{"$f":"+Zał.1_WPF_bazowy!#REF!","v":{"$error":"#REF!"}},{"$f":"+Zał.1_WPF_bazowy!#REF!","v":{"$error":"#REF!"}},{"$f":"+Zał.1_WPF_bazowy!#REF!","v":{"$error":"#REF!"}},{"$f":"+Zał.1_WPF_bazowy!#REF!","v":{"$error":"#REF!"}},{"$f":"+Zał.1_WPF_bazowy!#REF!","v":{"$error":"#REF!"}},{"$f":"+Zał.1_WPF_bazowy!#REF!","v":{"$error":"#REF!"}},{"$f":"+Zał.1_WPF_bazowy!#REF!","v":{"$error":"#REF!"}},{"$f":"+Zał.1_WPF_bazowy!#REF!","v":{"$error":"#REF!"}},{"$f":"+Zał.1_WPF_bazowy!#REF!","v":{"$error":"#REF!"}},{"$f":"+Zał.1_WPF_bazowy!#REF!","v":{"$error":"#REF!"}},{"$f":"+Zał.1_WPF_bazowy!#REF!","v":{"$error":"#REF!"}},{"$f":"+Zał.1_WPF_bazowy!#REF!","v":{"$error":"#REF!"}},{"$f":"+Zał.1_WPF_bazowy!#REF!","v":{"$error":"#REF!"}},{"$f":"+Zał.1_WPF_bazowy!#REF!","v":{"$error":"#REF!"}},{"$f":"+Zał.1_WPF_bazowy!#REF!","v":{"$error":"#REF!"}},{"$f":"+Zał.1_WPF_bazowy!#REF!","v":{"$error":"#REF!"}},{"$f":"+Zał.1_WPF_bazowy!#REF!","v":{"$error":"#REF!"}},{"$f":"+Zał.1_WPF_bazowy!#REF!","v":{"$error":"#REF!"}},{"$f":"+Zał.1_WPF_bazowy!#REF!","v":{"$error":"#REF!"}},{"$f":"+Zał.1_WPF_bazowy!#REF!","v":{"$error":"#REF!"}},{"$f":"+Zał.1_WPF_bazowy!#REF!","v":{"$error":"#REF!"}}]
[null,"2.1.2",null,"na spłatę przejętych zobowiązań samodzielnego publicznego zakładu opieki zdrowotnej przekształconego na zasadach określonych w przepisach  o działalności leczniczej, w wysokości w jakiej nie podlegają sfinansowaniu dotacją z budżetu państwa",{"$f":"+Zał.1_WPF_bazowy!E18","v":0},{"$f":"+Zał.1_WPF_bazowy!F18","v":0},{"$f":"+Zał.1_WPF_bazowy!G18","v":0},{"$f":"+Zał.1_WPF_bazowy!H18","v":0},{"$f":"+Zał.1_WPF_bazowy!I18","v":0},{"$f":"+Zał.1_WPF_bazowy!J18","v":0},{"$f":"+Zał.1_WPF_bazowy!K18","v":0},{"$f":"+Zał.1_WPF_bazowy!L18","v":0},{"$f":"+Zał.1_WPF_bazowy!M18","v":0},{"$f":"+Zał.1_WPF_bazowy!N18","v":0},{"$f":"+Zał.1_WPF_bazowy!O18","v":0},{"$f":"+Zał.1_WPF_bazowy!P18","v":0},{"$f":"+Zał.1_WPF_bazowy!Q18","v":0},{"$f":"+Zał.1_WPF_bazowy!#REF!","v":{"$error":"#REF!"}},{"$f":"+Zał.1_WPF_bazowy!#REF!","v":{"$error":"#REF!"}},{"$f":"+Zał.1_WPF_bazowy!#REF!","v":{"$error":"#REF!"}},{"$f":"+Zał.1_WPF_bazowy!#REF!","v":{"$error":"#REF!"}},{"$f":"+Zał.1_WPF_bazowy!#REF!","v":{"$error":"#REF!"}},{"$f":"+Zał.1_WPF_bazowy!#REF!","v":{"$error":"#REF!"}},{"$f":"+Zał.1_WPF_bazowy!#REF!","v":{"$error":"#REF!"}},{"$f":"+Zał.1_WPF_bazowy!#REF!","v":{"$error":"#REF!"}},{"$f":"+Zał.1_WPF_bazowy!#REF!","v":{"$error":"#REF!"}},{"$f":"+Zał.1_WPF_bazowy!#REF!","v":{"$error":"#REF!"}},{"$f":"+Zał.1_WPF_bazowy!#REF!","v":{"$error":"#REF!"}},{"$f":"+Zał.1_WPF_bazowy!#REF!","v":{"$error":"#REF!"}},{"$f":"+Zał.1_WPF_bazowy!#REF!","v":{"$error":"#REF!"}},{"$f":"+Zał.1_WPF_bazowy!#REF!","v":{"$error":"#REF!"}},{"$f":"+Zał.1_WPF_bazowy!#REF!","v":{"$error":"#REF!"}},{"$f":"+Zał.1_WPF_bazowy!#REF!","v":{"$error":"#REF!"}},{"$f":"+Zał.1_WPF_bazowy!#REF!","v":{"$error":"#REF!"}},{"$f":"+Zał.1_WPF_bazowy!#REF!","v":{"$error":"#REF!"}},{"$f":"+Zał.1_WPF_bazowy!#REF!","v":{"$error":"#REF!"}},{"$f":"+Zał.1_WPF_bazowy!#REF!","v":{"$error":"#REF!"}},{"$f":"+Zał.1_WPF_bazowy!#REF!","v":{"$error":"#REF!"}}]
["x","2.1.3",null,"wydatki na obsługę długu, w tym:",{"$f":"Zał.1_WPF_bazowy!E19","v":657163.69999999995},{"$f":"Zał.1_WPF_bazowy!F19","v":563582.46},{"$f":"Zał.1_WPF_bazowy!G19","v":480000},{"$f":"Zał.1_WPF_bazowy!H19","v":480000},{"$f":"+Zał.1_WPF_bazowy!I19","v":505000},{"$f":"+Zał.1_WPF_bazowy!J19","v":500000},{"$f":"+Zał.1_WPF_bazowy!K19","v":470000},{"$f":"+Zał.1_WPF_bazowy!L19","v":440000},{"$f":"+Zał.1_WPF_bazowy!M19","v":380000},{"$f":"+Zał.1_WPF_bazowy!N19","v":300000},{"$f":"+Zał.1_WPF_bazowy!O19","v":210000},{"$f":"+Zał.1_WPF_bazowy!P19","v":130000},{"$f":"+Zał.1_WPF_bazowy!Q19","v":40000},{"$f":"+Zał.1_WPF_bazowy!#REF!","v":{"$error":"#REF!"}},{"$f":"+Zał.1_WPF_bazowy!#REF!","v":{"$error":"#REF!"}},{"$f":"+Zał.1_WPF_bazowy!#REF!","v":{"$error":"#REF!"}},{"$f":"+Zał.1_WPF_bazowy!#REF!","v":{"$error":"#REF!"}},{"$f":"+Zał.1_WPF_bazowy!#REF!","v":{"$error":"#REF!"}},{"$f":"+Zał.1_WPF_bazowy!#REF!","v":{"$error":"#REF!"}},{"$f":"+Zał.1_WPF_bazowy!#REF!","v":{"$error":"#REF!"}},{"$f":"+Zał.1_WPF_bazowy!#REF!","v":{"$error":"#REF!"}},{"$f":"+Zał.1_WPF_bazowy!#REF!","v":{"$error":"#REF!"}},{"$f":"+Zał.1_WPF_bazowy!#REF!","v":{"$error":"#REF!"}},{"$f":"+Zał.1_WPF_bazowy!#REF!","v":{"$error":"#REF!"}},{"$f":"+Zał.1_WPF_bazowy!#REF!","v":{"$error":"#REF!"}},{"$f":"+Zał.1_WPF_bazowy!#REF!","v":{"$error":"#REF!"}},{"$f":"+Zał.1_WPF_bazowy!#REF!","v":{"$error":"#REF!"}},{"$f":"+Zał.1_WPF_bazowy!#REF!","v":{"$error":"#REF!"}},{"$f":"+Zał.1_WPF_bazowy!#REF!","v":{"$error":"#REF!"}},{"$f":"+Zał.1_WPF_bazowy!#REF!","v":{"$error":"#REF!"}},{"$f":"+Zał.1_WPF_bazowy!#REF!","v":{"$error":"#REF!"}},{"$f":"+Zał.1_WPF_bazowy!#REF!","v":{"$error":"#REF!"}},{"$f":"+Zał.1_WPF_bazowy!#REF!","v":{"$error":"#REF!"}},{"$f":"+Zał.1_WPF_bazowy!#REF!","v":{"$error":"#REF!"}}]
["x","2.1.3.1",null,"odsetki i dyskonto określone w art. 243 ust. 1 ustawy, w tym:",{"$f":"Zał.1_WPF_bazowy!E20","v":657163.69999999995},{"$f":"Zał.1_WPF_bazowy!F20","v":563582.46},{"$f":"Zał.1_WPF_bazowy!G20","v":475000},{"$f":"Zał.1_WPF_bazowy!H20","v":475000},{"$f":"+Zał.1_WPF_bazowy!I20","v":500000},{"$f":"+Zał.1_WPF_bazowy!J20","v":500000},{"$f":"+Zał.1_WPF_bazowy!K20","v":470000},{"$f":"+Zał.1_WPF_bazowy!L20","v":440000},{"$f":"+Zał.1_WPF_bazowy!M20","v":380000},{"$f":"+Zał.1_WPF_bazowy!N20","v":300000},{"$f":"+Zał.1_WPF_bazowy!O20","v":210000},{"$f":"+Zał.1_WPF_bazowy!P20","v":130000},{"$f":"+Zał.1_WPF_bazowy!Q20","v":40000},{"$f":"+Zał.1_WPF_bazowy!#REF!","v":{"$error":"#REF!"}},{"$f":"+Zał.1_WPF_bazowy!#REF!","v":{"$error":"#REF!"}},{"$f":"+Zał.1_WPF_bazowy!#REF!","v":{"$error":"#REF!"}},{"$f":"+Zał.1_WPF_bazowy!#REF!","v":{"$error":"#REF!"}},{"$f":"+Zał.1_WPF_bazowy!#REF!","v":{"$error":"#REF!"}},{"$f":"+Zał.1_WPF_bazowy!#REF!","v":{"$error":"#REF!"}},{"$f":"+Zał.1_WPF_bazowy!#REF!","v":{"$error":"#REF!"}},{"$f":"+Zał.1_WPF_bazowy!#REF!","v":{"$error":"#REF!"}},{"$f":"+Zał.1_WPF_bazowy!#REF!","v":{"$error":"#REF!"}},{"$f":"+Zał.1_WPF_bazowy!#REF!","v":{"$error":"#REF!"}},{"$f":"+Zał.1_WPF_bazowy!#REF!","v":{"$error":"#REF!"}},{"$f":"+Zał.1_WPF_bazowy!#REF!","v":{"$error":"#REF!"}},{"$f":"+Zał.1_WPF_bazowy!#REF!","v":{"$error":"#REF!"}},{"$f":"+Zał.1_WPF_bazowy!#REF!","v":{"$error":"#REF!"}},{"$f":"+Zał.1_WPF_bazowy!#REF!","v":{"$error":"#REF!"}},{"$f":"+Zał.1_WPF_bazowy!#REF!","v":{"$error":"#REF!"}},{"$f":"+Zał.1_WPF_bazowy!#REF!","v":{"$error":"#REF!"}},{"$f":"+Zał.1_WPF_bazowy!#REF!","v":{"$error":"#REF!"}},{"$f":"+Zał.1_WPF_bazowy!#REF!","v":{"$error":"#REF!"}},{"$f":"+Zał.1_WPF_bazowy!#REF!","v":{"$error":"#REF!"}},{"$f":"+Zał.1_WPF_bazowy!#REF!","v":{"$error":"#REF!"}}]
["x","2.1.3.1.1",null,"odsetki i dyskonto podlegające wyłączeniu z limitu spłaty zobowiązań, o którym mowa w art. 243 ustawy, w terminie nie dłuższym niż 90 dni po zakończeniu programu, projektu lub zadania i otrzymaniu refundacji z tych środków (bez odsetek i dyskonta od zobowiązań na wkład krajowy)",{"$f":"Zał.1_WPF_bazowy!E21","v":0},{"$f":"Zał.1_WPF_bazowy!F21","v":0},{"$f":"Zał.1_WPF_bazowy!G21","v":0},{"$f":"Zał.1_WPF_bazowy!H21","v":0},{"$f":"+Zał.1_WPF_bazowy!I21","v":0},{"$f":"+Zał.1_WPF_bazowy!J21","v":0},{"$f":"+Zał.1_WPF_bazowy!K21","v":0},{"$f":"+Zał.1_WPF_bazowy!L21","v":0},{"$f":"+Zał.1_WPF_bazowy!M21","v":0},{"$f":"+Zał.1_WPF_bazowy!N21","v":0},{"$f":"+Zał.1_WPF_bazowy!O21","v":0},{"$f":"+Zał.1_WPF_bazowy!P21","v":0},{"$f":"+Zał.1_WPF_bazowy!Q21","v":0},{"$f":"+Zał.1_WPF_bazowy!#REF!","v":{"$error":"#REF!"}},{"$f":"+Zał.1_WPF_bazowy!#REF!","v":{"$error":"#REF!"}},{"$f":"+Zał.1_WPF_bazowy!#REF!","v":{"$error":"#REF!"}},{"$f":"+Zał.1_WPF_bazowy!#REF!","v":{"$error":"#REF!"}},{"$f":"+Zał.1_WPF_bazowy!#REF!","v":{"$error":"#REF!"}},{"$f":"+Zał.1_WPF_bazowy!#REF!","v":{"$error":"#REF!"}},{"$f":"+Zał.1_WPF_bazowy!#REF!","v":{"$error":"#REF!"}},{"$f":"+Zał.1_WPF_bazowy!#REF!","v":{"$error":"#REF!"}},{"$f":"+Zał.1_WPF_bazowy!#REF!","v":{"$error":"#REF!"}},{"$f":"+Zał.1_WPF_bazowy!#REF!","v":{"$error":"#REF!"}},{"$f":"+Zał.1_WPF_bazowy!#REF!","v":{"$error":"#REF!"}},{"$f":"+Zał.1_WPF_bazowy!#REF!","v":{"$error":"#REF!"}},{"$f":"+Zał.1_WPF_bazowy!#REF!","v":{"$error":"#REF!"}},{"$f":"+Zał.1_WPF_bazowy!#REF!","v":{"$error":"#REF!"}},{"$f":"+Zał.1_WPF_bazowy!#REF!","v":{"$error":"#REF!"}},{"$f":"+Zał.1_WPF_bazowy!#REF!","v":{"$error":"#REF!"}},{"$f":"+Zał.1_WPF_bazowy!#REF!","v":{"$error":"#REF!"}},{"$f":"+Zał.1_WPF_bazowy!#REF!","v":{"$error":"#REF!"}},{"$f":"+Zał.1_WPF_bazowy!#REF!","v":{"$error":"#REF!"}},{"$f":"+Zał.1_WPF_bazowy!#REF!","v":{"$error":"#REF!"}},{"$f":"+Zał.1_WPF_bazowy!#REF!","v":{"$error":"#REF!"}}]
["x","2.1.3.1.2",null,"odsetki i dyskonto podlegające wyłączeniu z limitu spłaty zobowiązań, o którym mowa w art. 243 ustawy, z tytułu zobowiązań  zaciągniętych na wkład krajowy",{"$f":"Zał.1_WPF_bazowy!E22","v":0},{"$f":"Zał.1_WPF_bazowy!F22","v":0},{"$f":"Zał.1_WPF_bazowy!G22","v":0},{"$f":"Zał.1_WPF_bazowy!H22","v":0},{"$f":"+Zał.1_WPF_bazowy!I22","v":0},{"$f":"+Zał.1_WPF_bazowy!J22","v":0},{"$f":"+Zał.1_WPF_bazowy!K22","v":0},{"$f":"+Zał.1_WPF_bazowy!L22","v":0},{"$f":"+Zał.1_WPF_bazowy!M22","v":0},{"$f":"+Zał.1_WPF_bazowy!N22","v":0},{"$f":"+Zał.1_WPF_bazowy!O22","v":0},{"$f":"+Zał.1_WPF_bazowy!P22","v":0},{"$f":"+Zał.1_WPF_bazowy!Q22","v":0},{"$f":"+Zał.1_WPF_bazowy!#REF!","v":{"$error":"#REF!"}},{"$f":"+Zał.1_WPF_bazowy!#REF!","v":{"$error":"#REF!"}},{"$f":"+Zał.1_WPF_bazowy!#REF!","v":{"$error":"#REF!"}},{"$f":"+Zał.1_WPF_bazowy!#REF!","v":{"$error":"#REF!"}},{"$f":"+Zał.1_WPF_bazowy!#REF!","v":{"$error":"#REF!"}},{"$f":"+Zał.1_WPF_bazowy!#REF!","v":{"$error":"#REF!"}},{"$f":"+Zał.1_WPF_bazowy!#REF!","v":{"$error":"#REF!"}},{"$f":"+Zał.1_WPF_bazowy!#REF!","v":{"$error":"#REF!"}},{"$f":"+Zał.1_WPF_bazowy!#REF!","v":{"$error":"#REF!"}},{"$f":"+Zał.1_WPF_bazowy!#REF!","v":{"$error":"#REF!"}},{"$f":"+Zał.1_WPF_bazowy!#REF!","v":{"$error":"#REF!"}},{"$f":"+Zał.1_WPF_bazowy!#REF!","v":{"$error":"#REF!"}},{"$f":"+Zał.1_WPF_bazowy!#REF!","v":{"$error":"#REF!"}},{"$f":"+Zał.1_WPF_bazowy!#REF!","v":{"$error":"#REF!"}},{"$f":"+Zał.1_WPF_bazowy!#REF!","v":{"$error":"#REF!"}},{"$f":"+Zał.1_WPF_bazowy!#REF!","v":{"$error":"#REF!"}},{"$f":"+Zał.1_WPF_bazowy!#REF!","v":{"$error":"#REF!"}},{"$f":"+Zał.1_WPF_bazowy!#REF!","v":{"$error":"#REF!"}},{"$f":"+Zał.1_WPF_bazowy!#REF!","v":{"$error":"#REF!"}},{"$f":"+Zał.1_WPF_bazowy!#REF!","v":{"$error":"#REF!"}},{"$f":"+Zał.1_WPF_bazowy!#REF!","v":{"$error":"#REF!"}}]
["x","2.2",null,"Wydatki majątkowe",{"$f":"Zał.1_WPF_bazowy!E23","v":6829689.5999999996},{"$f":"Zał.1_WPF_bazowy!F23","v":6081495.2000000002},{"$f":"Zał.1_WPF_bazowy!G23","v":10519373},{"$f":"Zał.1_WPF_bazowy!H23","v":10519373},{"$f":"+Zał.1_WPF_bazowy!I23","v":2364000},{"$f":"+Zał.1_WPF_bazowy!J23","v":1421796},{"$f":"+Zał.1_WPF_bazowy!K23","v":1721796},{"$f":"+Zał.1_WPF_bazowy!L23","v":2039996},{"$f":"+Zał.1_WPF_bazowy!M23","v":2189996},{"$f":"+Zał.1_WPF_bazowy!N23","v":2689996},{"$f":"+Zał.1_WPF_bazowy!O23","v":3149996},{"$f":"+Zał.1_WPF_bazowy!P23","v":3482000},{"$f":"+Zał.1_WPF_bazowy!Q23","v":2981616},{"$f":"+Zał.1_WPF_bazowy!#REF!","v":{"$error":"#REF!"}},{"$f":"+Zał.1_WPF_bazowy!#REF!","v":{"$error":"#REF!"}},{"$f":"+Zał.1_WPF_bazowy!#REF!","v":{"$error":"#REF!"}},{"$f":"+Zał.1_WPF_bazowy!#REF!","v":{"$error":"#REF!"}},{"$f":"+Zał.1_WPF_bazowy!#REF!","v":{"$error":"#REF!"}},{"$f":"+Zał.1_WPF_bazowy!#REF!","v":{"$error":"#REF!"}},{"$f":"+Zał.1_WPF_bazowy!#REF!","v":{"$error":"#REF!"}},{"$f":"+Zał.1_WPF_bazowy!#REF!","v":{"$error":"#REF!"}},{"$f":"+Zał.1_WPF_bazowy!#REF!","v":{"$error":"#REF!"}},{"$f":"+Zał.1_WPF_bazowy!#REF!","v":{"$error":"#REF!"}},{"$f":"+Zał.1_WPF_bazowy!#REF!","v":{"$error":"#REF!"}},{"$f":"+Zał.1_WPF_bazowy!#REF!","v":{"$error":"#REF!"}},{"$f":"+Zał.1_WPF_bazowy!#REF!","v":{"$error":"#REF!"}},{"$f":"+Zał.1_WPF_bazowy!#REF!","v":{"$error":"#REF!"}},{"$f":"+Zał.1_WPF_bazowy!#REF!","v":{"$error":"#REF!"}},{"$f":"+Zał.1_WPF_bazowy!#REF!","v":{"$error":"#REF!"}},{"$f":"+Zał.1_WPF_bazowy!#REF!","v":{"$error":"#REF!"}},{"$f":"+Zał.1_WPF_bazowy!#REF!","v":{"$error":"#REF!"}},{"$f":"+Zał.1_WPF_bazowy!#REF!","v":{"$error":"#REF!"}},{"$f":"+Zał.1_WPF_bazowy!#REF!","v":{"$error":"#REF!"}},{"$f":"+Zał.1_WPF_bazowy!#REF!","v":{"$error":"#REF!"}}]
["x",3,"[1] -[2]","Wynik budżetu",{"$f":"Zał.1_WPF_bazowy!E24","v":-105938.83},{"$f":"Zał.1_WPF_bazowy!F24","v":1409486.15},{"$f":"Zał.1_WPF_bazowy!G24","v":-5930398.3799999999},{"$f":"+H10-H21","v":-5930398.3799999952},{"$f":"+I10-I21","v":0},{"$f":"+J10-J21","v":1478204},1678204,1860004,2210004,2210004,2250004,2418000,3418384,{"$error":"#REF!"},{"$error":"#REF!"},{"$error":"#REF!"},{"$error":"#REF!"},{"$error":"#REF!"},{"$error":"#REF!"},{"$error":"#REF!"},{"$error":"#REF!"},{"$error":"#REF!"},{"$error":"#REF!"},{"$error":"#REF!"},{"$error":"#REF!"},{"$error":"#REF!"},{"$error":"#REF!"},{"$error":"#REF!"},{"$error":"#REF!"},{"$error":"#REF!"},{"$error":"#REF!"},{"$error":"#REF!"},{"$error":"#REF!"},{"$error":"#REF!"}]
["x",4,"[4.1] + [4.2] + [4.3] + [4.4]","Przychody budżetu",{"$f":"Zał.1_WPF_bazowy!E25","v":7317411.2199999997},{"$f":"Zał.1_WPF_bazowy!F25","v":5010437.51},{"$f":"Zał.1_WPF_bazowy!G25","v":6846090.3799999999},{"$f":"+H33+H35+H37+H39","v":6846090.3799999999},{"$f":"+I33+I35+I37+I39","v":1215692},{"$f":"+J33+J35+J37+J39","v":0},0,0,0,0,0,0,0,{"$error":"#REF!"},{"$error":"#REF!"},{"$error":"#REF!"},{"$error":"#REF!"},{"$error":"#REF!"},{"$error":"#REF!"},{"$error":"#REF!"},{"$error":"#REF!"},{"$error":"#REF!"},{"$error":"#REF!"},{"$error":"#REF!"},{"$error":"#REF!"},{"$error":"#REF!"},{"$error":"#REF!"},{"$error":"#REF!"},{"$error":"#REF!"},{"$error":"#REF!"},{"$error":"#REF!"},{"$error":"#REF!"},{"$error":"#REF!"},{"$error":"#REF!"}]
["x","4.1",null,"Nadwyżka budżetowa z lat ubiegłych",{"$f":"Zał.1_WPF_bazowy!E26","v":0},{"$f":"Zał.1_WPF_bazowy!F26","v":0},{"$f":"Zał.1_WPF_bazowy!G26","v":0},{"$f":"Zał.1_WPF_bazowy!H26","v":0},{"$f":"+Zał.1_WPF_bazowy!I26","v":0},{"$f":"+Zał.1_WPF_bazowy!J26","v":0},{"$f":"+Zał.1_WPF_bazowy!K26","v":0},{"$f":"+Zał.1_WPF_bazowy!L26","v":0},{"$f":"+Zał.1_WPF_bazowy!M26","v":0},{"$f":"+Zał.1_WPF_bazowy!N26","v":0},{"$f":"+Zał.1_WPF_bazowy!O26","v":0},{"$f":"+Zał.1_WPF_bazowy!P26","v":0},{"$f":"+Zał.1_WPF_bazowy!Q26","v":0},{"$f":"+Zał.1_WPF_bazowy!#REF!","v":{"$error":"#REF!"}},{"$f":"+Zał.1_WPF_bazowy!#REF!","v":{"$error":"#REF!"}},{"$f":"+Zał.1_WPF_bazowy!#REF!","v":{"$error":"#REF!"}},{"$f":"+Zał.1_WPF_bazowy!#REF!","v":{"$error":"#REF!"}},{"$f":"+Zał.1_WPF_bazowy!#REF!","v":{"$error":"#REF!"}},{"$f":"+Zał.1_WPF_bazowy!#REF!","v":{"$error":"#REF!"}},{"$f":"+Zał.1_WPF_bazowy!#REF!","v":{"$error":"#REF!"}},{"$f":"+Zał.1_WPF_bazowy!#REF!","v":{"$error":"#REF!"}},{"$f":"+Zał.1_WPF_bazowy!#REF!","v":{"$error":"#REF!"}},{"$f":"+Zał.1_WPF_bazowy!#REF!","v":{"$error":"#REF!"}},{"$f":"+Zał.1_WPF_bazowy!#REF!","v":{"$error":"#REF!"}},{"$f":"+Zał.1_WPF_bazowy!#REF!","v":{"$error":"#REF!"}},{"$f":"+Zał.1_WPF_bazowy!#REF!","v":{"$error":"#REF!"}},{"$f":"+Zał.1_WPF_bazowy!#REF!","v":{"$error":"#REF!"}},{"$f":"+Zał.1_WPF_bazowy!#REF!","v":{"$error":"#REF!"}},{"$f":"+Zał.1_WPF_bazowy!#REF!","v":{"$error":"#REF!"}},{"$f":"+Zał.1_WPF_bazowy!#REF!","v":{"$error":"#REF!"}},{"$f":"+Zał.1_WPF_bazowy!#REF!","v":{"$error":"#REF!"}},{"$f":"+Zał.1_WPF_bazowy!#REF!","v":{"$error":"#REF!"}},{"$f":"+Zał.1_WPF_bazowy!#REF!","v":{"$error":"#REF!"}},{"$f":"+Zał.1_WPF_bazowy!#REF!","v":{"$error":"#REF!"}}]
["x","4.1.1",null,"w tym na pokrycie deficytu budżetu",{"$f":"Zał.1_WPF_bazowy!E27","v":0},{"$f":"Zał.1_WPF_bazowy!F27","v":0},{"$f":"Zał.1_WPF_bazowy!G27","v":0},{"$f":"Zał.1_WPF_bazowy!H27","v":0},{"$f":"+Zał.1_WPF_bazowy!I27","v":0},{"$f":"+Zał.1_WPF_bazowy!J27","v":0},{"$f":"+Zał.1_WPF_bazowy!K27","v":0},{"$f":"+Zał.1_WPF_bazowy!L27","v":0},{"$f":"+Zał.1_WPF_bazowy!M27","v":0},{"$f":"+Zał.1_WPF_bazowy!N27","v":0},{"$f":"+Zał.1_WPF_bazowy!O27","v":0},{"$f":"+Zał.1_WPF_bazowy!P27","v":0},{"$f":"+Zał.1_WPF_bazowy!Q27","v":0},{"$f":"+Zał.1_WPF_bazowy!#REF!","v":{"$error":"#REF!"}},{"$f":"+Zał.1_WPF_bazowy!#REF!","v":{"$error":"#REF!"}},{"$f":"+Zał.1_WPF_bazowy!#REF!","v":{"$error":"#REF!"}},{"$f":"+Zał.1_WPF_bazowy!#REF!","v":{"$error":"#REF!"}},{"$f":"+Zał.1_WPF_bazowy!#REF!","v":{"$error":"#REF!"}},{"$f":"+Zał.1_WPF_bazowy!#REF!","v":{"$error":"#REF!"}},{"$f":"+Zał.1_WPF_bazowy!#REF!","v":{"$error":"#REF!"}},{"$f":"+Zał.1_WPF_bazowy!#REF!","v":{"$error":"#REF!"}},{"$f":"+Zał.1_WPF_bazowy!#REF!","v":{"$error":"#REF!"}},{"$f":"+Zał.1_WPF_bazowy!#REF!","v":{"$error":"#REF!"}},{"$f":"+Zał.1_WPF_bazowy!#REF!","v":{"$error":"#REF!"}},{"$f":"+Zał.1_WPF_bazowy!#REF!","v":{"$error":"#REF!"}},{"$f":"+Zał.1_WPF_bazowy!#REF!","v":{"$error":"#REF!"}},{"$f":"+Zał.1_WPF_bazowy!#REF!","v":{"$error":"#REF!"}},{"$f":"+Zał.1_WPF_bazowy!#REF!","v":{"$error":"#REF!"}},{"$f":"+Zał.1_WPF_bazowy!#REF!","v":{"$error":"#REF!"}},{"$f":"+Zał.1_WPF_bazowy!#REF!","v":{"$error":"#REF!"}},{"$f":"+Zał.1_WPF_bazowy!#REF!","v":{"$error":"#REF!"}},{"$f":"+Zał.1_WPF_bazowy!#REF!","v":{"$error":"#REF!"}},{"$f":"+Zał.1_WPF_bazowy!#REF!","v":{"$error":"#REF!"}},{"$f":"+Zał.1_WPF_bazowy!#REF!","v":{"$error":"#REF!"}}]
["x","4.2",null,"Wolne środki, o których mowa w art. 217 ust.2 pkt 6 ustawy",{"$f":"Zał.1_WPF_bazowy!E28","v":2607411.2200000002},{"$f":"Zał.1_WPF_bazowy!F28","v":2502437.5099999998},{"$f":"Zał.1_WPF_bazowy!G28","v":4393398.38},{"$f":"Zał.1_WPF_bazowy!H28","v":4393398.38},{"$f":"+Zał.1_WPF_bazowy!I28","v":0},{"$f":"+Zał.1_WPF_bazowy!J28","v":0},{"$f":"+Zał.1_WPF_bazowy!K28","v":0},{"$f":"+Zał.1_WPF_bazowy!L28","v":0},{"$f":"+Zał.1_WPF_bazowy!M28","v":0},{"$f":"+Zał.1_WPF_bazowy!N28","v":0},{"$f":"+Zał.1_WPF_bazowy!O28","v":0},{"$f":"+Zał.1_WPF_bazowy!P28","v":0},{"$f":"+Zał.1_WPF_bazowy!Q28","v":0},{"$f":"+Zał.1_WPF_bazowy!#REF!","v":{"$error":"#REF!"}},{"$f":"+Zał.1_WPF_bazowy!#REF!","v":{"$error":"#REF!"}},{"$f":"+Zał.1_WPF_bazowy!#REF!","v":{"$error":"#REF!"}},{"$f":"+Zał.1_WPF_bazowy!#REF!","v":{"$error":"#REF!"}},{"$f":"+Zał.1_WPF_bazowy!#REF!","v":{"$error":"#REF!"}},{"$f":"+Zał.1_WPF_bazowy!#REF!","v":{"$error":"#REF!"}},{"$f":"+Zał.1_WPF_bazowy!#REF!","v":{"$error":"#REF!"}},{"$f":"+Zał.1_WPF_bazowy!#REF!","v":{"$error":"#REF!"}},{"$f":"+Zał.1_WPF_bazowy!#REF!","v":{"$error":"#REF!"}},{"$f":"+Zał.1_WPF_bazowy!#REF!","v":{"$error":"#REF!"}},{"$f":"+Zał.1_WPF_bazowy!#REF!","v":{"$error":"#REF!"}},{"$f":"+Zał.1_WPF_bazowy!#REF!","v":{"$error":"#REF!"}},{"$f":"+Zał.1_WPF_bazowy!#REF!","v":{"$error":"#REF!"}},{"$f":"+Zał.1_WPF_bazowy!#REF!","v":{"$error":"#REF!"}},{"$f":"+Zał.1_WPF_bazowy!#REF!","v":{"$error":"#REF!"}},{"$f":"+Zał.1_WPF_bazowy!#REF!","v":{"$error":"#REF!"}},{"$f":"+Zał.1_WPF_bazowy!#REF!","v":{"$error":"#REF!"}},{"$f":"+Zał.1_WPF_bazowy!#REF!","v":{"$error":"#REF!"}},{"$f":"+Zał.1_WPF_bazowy!#REF!","v":{"$error":"#REF!"}},{"$f":"+Zał.1_WPF_bazowy!#REF!","v":{"$error":"#REF!"}},{"$f":"+Zał.1_WPF_bazowy!#REF!","v":{"$error":"#REF!"}}]
["x","4.2.1",null,"w tym na pokrycie deficytu budżetu",{"$f":"Zał.1_WPF_bazowy!E29","v":105938.83},{"$f":"Zał.1_WPF_bazowy!F29","v":2502437.5099999998},{"$f":"Zał.1_WPF_bazowy!G29","v":4393398.38},{"$f":"Zał.1_WPF_bazowy!H29","v":4393398.38},{"$f":"+Zał.1_WPF_bazowy!I29","v":0},{"$f":"+Zał.1_WPF_bazowy!J29","v":0},{"$f":"+Zał.1_WPF_bazowy!K29","v":0},{"$f":"+Zał.1_WPF_bazowy!L29","v":0},{"$f":"+Zał.1_WPF_bazowy!M29","v":0},{"$f":"+Zał.1_WPF_bazowy!N29","v":0},{"$f":"+Zał.1_WPF_bazowy!O29","v":0},{"$f":"+Zał.1_WPF_bazowy!P29","v":0},{"$f":"+Zał.1_WPF_bazowy!Q29","v":0},{"$f":"+Zał.1_WPF_bazowy!#REF!","v":{"$error":"#REF!"}},{"$f":"+Zał.1_WPF_bazowy!#REF!","v":{"$error":"#REF!"}},{"$f":"+Zał.1_WPF_bazowy!#REF!","v":{"$error":"#REF!"}},{"$f":"+Zał.1_WPF_bazowy!#REF!","v":{"$error":"#REF!"}},{"$f":"+Zał.1_WPF_bazowy!#REF!","v":{"$error":"#REF!"}},{"$f":"+Zał.1_WPF_bazowy!#REF!","v":{"$error":"#REF!"}},{"$f":"+Zał.1_WPF_bazowy!#REF!","v":{"$error":"#REF!"}},{"$f":"+Zał.1_WPF_bazowy!#REF!","v":{"$error":"#REF!"}},{"$f":"+Zał.1_WPF_bazowy!#REF!","v":{"$error":"#REF!"}},{"$f":"+Zał.1_WPF_bazowy!#REF!","v":{"$error":"#REF!"}},{"$f":"+Zał.1_WPF_bazowy!#REF!","v":{"$error":"#REF!"}},{"$f":"+Zał.1_WPF_bazowy!#REF!","v":{"$error":"#REF!"}},{"$f":"+Zał.1_WPF_bazowy!#REF!","v":{"$error":"#REF!"}},{"$f":"+Zał.1_WPF_bazowy!#REF!","v":{"$error":"#REF!"}},{"$f":"+Zał.1_WPF_bazowy!#REF!","v":{"$error":"#REF!"}},{"$f":"+Zał.1_WPF_bazowy!#REF!","v":{"$error":"#REF!"}},{"$f":"+Zał.1_WPF_bazowy!#REF!","v":{"$error":"#REF!"}},{"$f":"+Zał.1_WPF_bazowy!#REF!","v":{"$error":"#REF!"}},{"$f":"+Zał.1_WPF_bazowy!#REF!","v":{"$error":"#REF!"}},{"$f":"+Zał.1_WPF_bazowy!#REF!","v":{"$error":"#REF!"}},{"$f":"+Zał.1_WPF_bazowy!#REF!","v":{"$error":"#REF!"}}]
["x","4.3",null,"Kredyty, pożyczki, emisja papierów wartościowych",{"$f":"Zał.1_WPF_bazowy!E30","v":4710000},{"$f":"Zał.1_WPF_bazowy!F30","v":2508000},{"$f":"Zał.1_WPF_bazowy!G30","v":2452692},{"$f":"Zał.1_WPF_bazowy!H30","v":2452692},{"$f":"+Zał.1_WPF_bazowy!I30","v":1215692},{"$f":"+Zał.1_WPF_bazowy!J30","v":0},{"$f":"+Zał.1_WPF_bazowy!K30","v":0},{"$f":"+Zał.1_WPF_bazowy!L30","v":0},{"$f":"+Zał.1_WPF_bazowy!M30","v":0},{"$f":"+Zał.1_WPF_bazowy!N30","v":0},{"$f":"+Zał.1_WPF_bazowy!O30","v":0},{"$f":"+Zał.1_WPF_bazowy!P30","v":0},{"$f":"+Zał.1_WPF_bazowy!Q30","v":0},{"$f":"+Zał.1_WPF_bazowy!#REF!","v":{"$error":"#REF!"}},{"$f":"+Zał.1_WPF_bazowy!#REF!","v":{"$error":"#REF!"}},{"$f":"+Zał.1_WPF_bazowy!#REF!","v":{"$error":"#REF!"}},{"$f":"+Zał.1_WPF_bazowy!#REF!","v":{"$error":"#REF!"}},{"$f":"+Zał.1_WPF_bazowy!#REF!","v":{"$error":"#REF!"}},{"$f":"+Zał.1_WPF_bazowy!#REF!","v":{"$error":"#REF!"}},{"$f":"+Zał.1_WPF_bazowy!#REF!","v":{"$error":"#REF!"}},{"$f":"+Zał.1_WPF_bazowy!#REF!","v":{"$error":"#REF!"}},{"$f":"+Zał.1_WPF_bazowy!#REF!","v":{"$error":"#REF!"}},{"$f":"+Zał.1_WPF_bazowy!#REF!","v":{"$error":"#REF!"}},{"$f":"+Zał.1_WPF_bazowy!#REF!","v":{"$error":"#REF!"}},{"$f":"+Zał.1_WPF_bazowy!#REF!","v":{"$error":"#REF!"}},{"$f":"+Zał.1_WPF_bazowy!#REF!","v":{"$error":"#REF!"}},{"$f":"+Zał.1_WPF_bazowy!#REF!","v":{"$error":"#REF!"}},{"$f":"+Zał.1_WPF_bazowy!#REF!","v":{"$error":"#REF!"}},{"$f":"+Zał.1_WPF_bazowy!#REF!","v":{"$error":"#REF!"}},{"$f":"+Zał.1_WPF_bazowy!#REF!","v":{"$error":"#REF!"}},{"$f":"+Zał.1_WPF_bazowy!#REF!","v":{"$error":"#REF!"}},{"$f":"+Zał.1_WPF_bazowy!#REF!","v":{"$error":"#REF!"}},{"$f":"+Zał.1_WPF_bazowy!#REF!","v":{"$error":"#REF!"}},{"$f":"+Zał.1_WPF_bazowy!#REF!","v":{"$error":"#REF!"}}]
["x","4.3.1",null,"w tym na pokrycie deficytu budżetu",{"$f":"Zał.1_WPF_bazowy!E31","v":0},{"$f":"Zał.1_WPF_bazowy!F31","v":0},{"$f":"Zał.1_WPF_bazowy!G31","v":1537000},{"$f":"Zał.1_WPF_bazowy!H31","v":1537000},{"$f":"+Zał.1_WPF_bazowy!I31","v":0},{"$f":"+Zał.1_WPF_bazowy!J31","v":0},{"$f":"+Zał.1_WPF_bazowy!K31","v":0},{"$f":"+Zał.1_WPF_bazowy!L31","v":0},{"$f":"+Zał.1_WPF_bazowy!M31","v":0},{"$f":"+Zał.1_WPF_bazowy!N31","v":0},{"$f":"+Zał.1_WPF_bazowy!O31","v":0},{"$f":"+Zał.1_WPF_bazowy!P31","v":0},{"$f":"+Zał.1_WPF_bazowy!Q31","v":0},{"$f":"+Zał.1_WPF_bazowy!#REF!","v":{"$error":"#REF!"}},{"$f":"+Zał.1_WPF_bazowy!#REF!","v":{"$error":"#REF!"}},{"$f":"+Zał.1_WPF_bazowy!#REF!","v":{"$error":"#REF!"}},{"$f":"+Zał.1_WPF_bazowy!#REF!","v":{"$error":"#REF!"}},{"$f":"+Zał.1_WPF_bazowy!#REF!","v":{"$error":"#REF!"}},{"$f":"+Zał.1_WPF_bazowy!#REF!","v":{"$error":"#REF!"}},{"$f":"+Zał.1_WPF_bazowy!#REF!","v":{"$error":"#REF!"}},{"$f":"+Zał.1_WPF_bazowy!#REF!","v":{"$error":"#REF!"}},{"$f":"+Zał.1_WPF_bazowy!#REF!","v":{"$error":"#REF!"}},{"$f":"+Zał.1_WPF_bazowy!#REF!","v":{"$error":"#REF!"}},{"$f":"+Zał.1_WPF_bazowy!#REF!","v":{"$error":"#REF!"}},{"$f":"+Zał.1_WPF_bazowy!#REF!","v":{"$error":"#REF!"}},{"$f":"+Zał.1_WPF_bazowy!#REF!","v":{"$error":"#REF!"}},{"$f":"+Zał.1_WPF_bazowy!#REF!","v":{"$error":"#REF!"}},{"$f":"+Zał.1_WPF_bazowy!#REF!","v":{"$error":"#REF!"}},{"$f":"+Zał.1_WPF_bazowy!#REF!","v":{"$error":"#REF!"}},{"$f":"+Zał.1_WPF_bazowy!#REF!","v":{"$error":"#REF!"}},{"$f":"+Zał.1_WPF_bazowy!#REF!","v":{"$error":"#REF!"}},{"$f":"+Zał.1_WPF_bazowy!#REF!","v":{"$error":"#REF!"}},{"$f":"+Zał.1_WPF_bazowy!#REF!","v":{"$error":"#REF!"}},{"$f":"+Zał.1_WPF_bazowy!#REF!","v":{"$error":"#REF!"}}]
["x","4.4",null," Inne przychody niezwiązane z zaciągnięciem długu",{"$f":"Zał.1_WPF_bazowy!E32","v":0},{"$f":"Zał.1_WPF_bazowy!F32","v":0},{"$f":"Zał.1_WPF_bazowy!G32","v":0},{"$f":"Zał.1_WPF_bazowy!H32","v":0},{"$f":"+Zał.1_WPF_bazowy!I32","v":0},{"$f":"+Zał.1_WPF_bazowy!J32","v":0},{"$f":"+Zał.1_WPF_bazowy!K32","v":0},{"$f":"+Zał.1_WPF_bazowy!L32","v":0},{"$f":"+Zał.1_WPF_bazowy!M32","v":0},{"$f":"+Zał.1_WPF_bazowy!N32","v":0},{"$f":"+Zał.1_WPF_bazowy!O32","v":0},{"$f":"+Zał.1_WPF_bazowy!P32","v":0},{"$f":"+Zał.1_WPF_bazowy!Q32","v":0},{"$f":"+Zał.1_WPF_bazowy!#REF!","v":{"$error":"#REF!"}},{"$f":"+Zał.1_WPF_bazowy!#REF!","v":{"$error":"#REF!"}},{"$f":"+Zał.1_WPF_bazowy!#REF!","v":{"$error":"#REF!"}},{"$f":"+Zał.1_WPF_bazowy!#REF!","v":{"$error":"#REF!"}},{"$f":"+Zał.1_WPF_bazowy!#REF!","v":{"$error":"#REF!"}},{"$f":"+Zał.1_WPF_bazowy!#REF!","v":{"$error":"#REF!"}},{"$f":"+Zał.1_WPF_bazowy!#REF!","v":{"$error":"#REF!"}},{"$f":"+Zał.1_WPF_bazowy!#REF!","v":{"$error":"#REF!"}},{"$f":"+Zał.1_WPF_bazowy!#REF!","v":{"$error":"#REF!"}},{"$f":"+Zał.1_WPF_bazowy!#REF!","v":{"$error":"#REF!"}},{"$f":"+Zał.1_WPF_bazowy!#REF!","v":{"$error":"#REF!"}},{"$f":"+Zał.1_WPF_bazowy!#REF!","v":{"$error":"#REF!"}},{"$f":"+Zał.1_WPF_bazowy!#REF!","v":{"$error":"#REF!"}},{"$f":"+Zał.1_WPF_bazowy!#REF!","v":{"$error":"#REF!"}},{"$f":"+Zał.1_WPF_bazowy!#REF!","v":{"$error":"#REF!"}},{"$f":"+Zał.1_WPF_bazowy!#REF!","v":{"$error":"#REF!"}},{"$f":"+Zał.1_WPF_bazowy!#REF!","v":{"$error":"#REF!"}},{"$f":"+Zał.1_WPF_bazowy!#REF!","v":{"$error":"#REF!"}},{"$f":"+Zał.1_WPF_bazowy!#REF!","v":{"$error":"#REF!"}},{"$f":"+Zał.1_WPF_bazowy!#REF!","v":{"$error":"#REF!"}},{"$f":"+Zał.1_WPF_bazowy!#REF!","v":{"$error":"#REF!"}}]
["x","4.4.1",null,"w tym na pokrycie deficytu budżetu",{"$f":"Zał.1_WPF_bazowy!E33","v":0},{"$f":"Zał.1_WPF_bazowy!F33","v":0},{"$f":"Zał.1_WPF_bazowy!G33","v":0},{"$f":"Zał.1_WPF_bazowy!H33","v":0},{"$f":"+Zał.1_WPF_bazowy!I33","v":0},{"$f":"+Zał.1_WPF_bazowy!J33","v":0},{"$f":"+Zał.1_WPF_bazowy!K33","v":0},{"$f":"+Zał.1_WPF_bazowy!L33","v":0},{"$f":"+Zał.1_WPF_bazowy!M33","v":0},{"$f":"+Zał.1_WPF_bazowy!N33","v":0},{"$f":"+Zał.1_WPF_bazowy!O33","v":0},{"$f":"+Zał.1_WPF_bazowy!P33","v":0},{"$f":"+Zał.1_WPF_bazowy!Q33","v":0},{"$f":"+Zał.1_WPF_bazowy!#REF!","v":{"$error":"#REF!"}},{"$f":"+Zał.1_WPF_bazowy!#REF!","v":{"$error":"#REF!"}},{"$f":"+Zał.1_WPF_bazowy!#REF!","v":{"$error":"#REF!"}},{"$f":"+Zał.1_WPF_bazowy!#REF!","v":{"$error":"#REF!"}},{"$f":"+Zał.1_WPF_bazowy!#REF!","v":{"$error":"#REF!"}},{"$f":"+Zał.1_WPF_bazowy!#REF!","v":{"$error":"#REF!"}},{"$f":"+Zał.1_WPF_bazowy!#REF!","v":{"$error":"#REF!"}},{"$f":"+Zał.1_WPF_bazowy!#REF!","v":{"$error":"#REF!"}},{"$f":"+Zał.1_WPF_bazowy!#REF!","v":{"$error":"#REF!"}},{"$f":"+Zał.1_WPF_bazowy!#REF!","v":{"$error":"#REF!"}},{"$f":"+Zał.1_WPF_bazowy!#REF!","v":{"$error":"#REF!"}},{"$f":"+Zał.1_WPF_bazowy!#REF!","v":{"$error":"#REF!"}},{"$f":"+Zał.1_WPF_bazowy!#REF!","v":{"$error":"#REF!"}},{"$f":"+Zał.1_WPF_bazowy!#REF!","v":{"$error":"#REF!"}},{"$f":"+Zał.1_WPF_bazowy!#REF!","v":{"$error":"#REF!"}},{"$f":"+Zał.1_WPF_bazowy!#REF!","v":{"$error":"#REF!"}},{"$f":"+Zał.1_WPF_bazowy!#REF!","v":{"$error":"#REF!"}},{"$f":"+Zał.1_WPF_bazowy!#REF!","v":{"$error":"#REF!"}},{"$f":"+Zał.1_WPF_bazowy!#REF!","v":{"$error":"#REF!"}},{"$f":"+Zał.1_WPF_bazowy!#REF!","v":{"$error":"#REF!"}},{"$f":"+Zał.1_WPF_bazowy!#REF!","v":{"$error":"#REF!"}}]
["x",5,"[5.1] + [5.2]","Rozchody budżetu",{"$f":"Zał.1_WPF_bazowy!E34","v":1903176.7},{"$f":"Zał.1_WPF_bazowy!F34","v":2026525.28},{"$f":"Zał.1_WPF_bazowy!G34","v":915692},{"$f":"+H42+H47","v":915692},1215692,1478204,1678204,1860004,2210004,2210004,2250004,2418000,3418384,{"$error":"#REF!"},{"$error":"#REF!"},{"$error":"#REF!"},{"$error":"#REF!"},{"$error":"#REF!"},{"$error":"#REF!"},{"$error":"#REF!"},{"$error":"#REF!"},{"$error":"#REF!"},{"$error":"#REF!"},{"$error":"#REF!"},{"$error":"#REF!"},{"$error":"#REF!"},{"$error":"#REF!"},{"$error":"#REF!"},{"$error":"#REF!"},{"$error":"#REF!"},{"$error":"#REF!"},{"$error":"#REF!"},{"$error":"#REF!"},{"$error":"#REF!"}]
["x","5.1",null,"Spłaty rat kapitałowych kredytów i pożyczek oraz wykup papierów wartościowych",{"$f":"Zał.1_WPF_bazowy!E35","v":1903176.7},{"$f":"Zał.1_WPF_bazowy!F35","v":2026525.28},{"$f":"Zał.1_WPF_bazowy!G35","v":915692},{"$f":"Zał.1_WPF_bazowy!H35","v":915692},{"$f":"+Zał.1_WPF_bazowy!I35","v":1215692},{"$f":"+Zał.1_WPF_bazowy!J35","v":1478204},{"$f":"+Zał.1_WPF_bazowy!K35","v":1678204},{"$f":"+Zał.1_WPF_bazowy!L35","v":1860004},{"$f":"+Zał.1_WPF_bazowy!M35","v":2210004},{"$f":"+Zał.1_WPF_bazowy!N35","v":2210004},{"$f":"+Zał.1_WPF_bazowy!O35","v":2250004},{"$f":"+Zał.1_WPF_bazowy!P35","v":2418000},{"$f":"+Zał.1_WPF_bazowy!Q35","v":3418384},{"$f":"+Zał.1_WPF_bazowy!#REF!","v":{"$error":"#REF!"}},{"$f":"+Zał.1_WPF_bazowy!#REF!","v":{"$error":"#REF!"}},{"$f":"+Zał.1_WPF_bazowy!#REF!","v":{"$error":"#REF!"}},{"$f":"+Zał.1_WPF_bazowy!#REF!","v":{"$error":"#REF!"}},{"$f":"+Zał.1_WPF_bazowy!#REF!","v":{"$error":"#REF!"}},{"$f":"+Zał.1_WPF_bazowy!#REF!","v":{"$error":"#REF!"}},{"$f":"+Zał.1_WPF_bazowy!#REF!","v":{"$error":"#REF!"}},{"$f":"+Zał.1_WPF_bazowy!#REF!","v":{"$error":"#REF!"}},{"$f":"+Zał.1_WPF_bazowy!#REF!","v":{"$error":"#REF!"}},{"$f":"+Zał.1_WPF_bazowy!#REF!","v":{"$error":"#REF!"}},{"$f":"+Zał.1_WPF_bazowy!#REF!","v":{"$error":"#REF!"}},{"$f":"+Zał.1_WPF_bazowy!#REF!","v":{"$error":"#REF!"}},{"$f":"+Zał.1_WPF_bazowy!#REF!","v":{"$error":"#REF!"}},{"$f":"+Zał.1_WPF_bazowy!#REF!","v":{"$error":"#REF!"}},{"$f":"+Zał.1_WPF_bazowy!#REF!","v":{"$error":"#REF!"}},{"$f":"+Zał.1_WPF_bazowy!#REF!","v":{"$error":"#REF!"}},{"$f":"+Zał.1_WPF_bazowy!#REF!","v":{"$error":"#REF!"}},{"$f":"+Zał.1_WPF_bazowy!#REF!","v":{"$error":"#REF!"}},{"$f":"+Zał.1_WPF_bazowy!#REF!","v":{"$error":"#REF!"}},{"$f":"+Zał.1_WPF_bazowy!#REF!","v":{"$error":"#REF!"}},{"$f":"+Zał.1_WPF_bazowy!#REF!","v":{"$error":"#REF!"}}]
["x","5.1.1","[5.1.1.1] + [5.1.1.2] + [5.1.1.3]","w tym łączna kwota przypadających na dany rok kwot ustawowych wyłączeń z limitu spłaty zobowiązań, o którym mowa w art. 243 ustawy, z tego:",{"$f":"Zał.1_WPF_bazowy!E36","v":0},{"$f":"Zał.1_WPF_bazowy!F36","v":0},{"$f":"Zał.1_WPF_bazowy!G36","v":0},{"$f":"+H44+H45+H46","v":0},{"$f":"+I44+I45+I46","v":0},0,0,0,0,0,0,0,0,{"$error":"#REF!"},{"$error":"#REF!"},{"$error":"#REF!"},{"$error":"#REF!"},{"$error":"#REF!"},{"$error":"#REF!"},{"$error":"#REF!"},{"$error":"#REF!"},{"$error":"#REF!"},{"$error":"#REF!"},{"$error":"#REF!"},{"$error":"#REF!"},{"$error":"#REF!"},{"$error":"#REF!"},{"$error":"#REF!"},{"$error":"#REF!"},{"$error":"#REF!"},{"$error":"#REF!"},{"$error":"#REF!"},{"$error":"#REF!"},{"$error":"#REF!"}]
["x","5.1.1.1",null,"kwota przypadających na dany rok kwot ustawowych wyłączeń określonych w art. 243 ust. 3 ustawy",{"$f":"Zał.1_WPF_bazowy!E37","v":0},{"$f":"Zał.1_WPF_bazowy!F37","v":0},{"$f":"Zał.1_WPF_bazowy!G37","v":0},{"$f":"Zał.1_WPF_bazowy!H37","v":0},{"$f":"+Zał.1_WPF_bazowy!I37","v":0},{"$f":"+Zał.1_WPF_bazowy!J37","v":0},{"$f":"+Zał.1_WPF_bazowy!K37","v":0},{"$f":"+Zał.1_WPF_bazowy!L37","v":0},{"$f":"+Zał.1_WPF_bazowy!M37","v":0},{"$f":"+Zał.1_WPF_bazowy!N37","v":0},{"$f":"+Zał.1_WPF_bazowy!O37","v":0},{"$f":"+Zał.1_WPF_bazowy!P37","v":0},{"$f":"+Zał.1_WPF_bazowy!Q37","v":0},{"$f":"+Zał.1_WPF_bazowy!#REF!","v":{"$error":"#REF!"}},{"$f":"+Zał.1_WPF_bazowy!#REF!","v":{"$error":"#REF!"}},{"$f":"+Zał.1_WPF_bazowy!#REF!","v":{"$error":"#REF!"}},{"$f":"+Zał.1_WPF_bazowy!#REF!","v":{"$error":"#REF!"}},{"$f":"+Zał.1_WPF_bazowy!#REF!","v":{"$error":"#REF!"}},{"$f":"+Zał.1_WPF_bazowy!#REF!","v":{"$error":"#REF!"}},{"$f":"+Zał.1_WPF_bazowy!#REF!","v":{"$error":"#REF!"}},{"$f":"+Zał.1_WPF_bazowy!#REF!","v":{"$error":"#REF!"}},{"$f":"+Zał.1_WPF_bazowy!#REF!","v":{"$error":"#REF!"}},{"$f":"+Zał.1_WPF_bazowy!#REF!","v":{"$error":"#REF!"}},{"$f":"+Zał.1_WPF_bazowy!#REF!","v":{"$error":"#REF!"}},{"$f":"+Zał.1_WPF_bazowy!#REF!","v":{"$error":"#REF!"}},{"$f":"+Zał.1_WPF_bazowy!#REF!","v":{"$error":"#REF!"}},{"$f":"+Zał.1_WPF_bazowy!#REF!","v":{"$error":"#REF!"}},{"$f":"+Zał.1_WPF_bazowy!#REF!","v":{"$error":"#REF!"}},{"$f":"+Zał.1_WPF_bazowy!#REF!","v":{"$error":"#REF!"}},{"$f":"+Zał.1_WPF_bazowy!#REF!","v":{"$error":"#REF!"}},{"$f":"+Zał.1_WPF_bazowy!#REF!","v":{"$error":"#REF!"}},{"$f":"+Zał.1_WPF_bazowy!#REF!","v":{"$error":"#REF!"}},{"$f":"+Zał.1_WPF_bazowy!#REF!","v":{"$error":"#REF!"}},{"$f":"+Zał.1_WPF_bazowy!#REF!","v":{"$error":"#REF!"}}]
["x","5.1.1.2",null,"kwota przypadających na dany rok kwot ustawowych wyłączeń określonych w art. 243 ust. 3a ustawy",{"$f":"Zał.1_WPF_bazowy!E38","v":0},{"$f":"Zał.1_WPF_bazowy!F38","v":0},{"$f":"Zał.1_WPF_bazowy!G38","v":0},{"$f":"Zał.1_WPF_bazowy!H38","v":0},{"$f":"+Zał.1_WPF_bazowy!I38","v":0},{"$f":"+Zał.1_WPF_bazowy!J38","v":0},{"$f":"+Zał.1_WPF_bazowy!K38","v":0},{"$f":"+Zał.1_WPF_bazowy!L38","v":0},{"$f":"+Zał.1_WPF_bazowy!M38","v":0},{"$f":"+Zał.1_WPF_bazowy!N38","v":0},{"$f":"+Zał.1_WPF_bazowy!O38","v":0},{"$f":"+Zał.1_WPF_bazowy!P38","v":0},{"$f":"+Zał.1_WPF_bazowy!Q38","v":0},{"$f":"+Zał.1_WPF_bazowy!#REF!","v":{"$error":"#REF!"}},{"$f":"+Zał.1_WPF_bazowy!#REF!","v":{"$error":"#REF!"}},{"$f":"+Zał.1_WPF_bazowy!#REF!","v":{"$error":"#REF!"}},{"$f":"+Zał.1_WPF_bazowy!#REF!","v":{"$error":"#REF!"}},{"$f":"+Zał.1_WPF_bazowy!#REF!","v":{"$error":"#REF!"}},{"$f":"+Zał.1_WPF_bazowy!#REF!","v":{"$error":"#REF!"}},{"$f":"+Zał.1_WPF_bazowy!#REF!","v":{"$error":"#REF!"}},{"$f":"+Zał.1_WPF_bazowy!#REF!","v":{"$error":"#REF!"}},{"$f":"+Zał.1_WPF_bazowy!#REF!","v":{"$error":"#REF!"}},{"$f":"+Zał.1_WPF_bazowy!#REF!","v":{"$error":"#REF!"}},{"$f":"+Zał.1_WPF_bazowy!#REF!","v":{"$error":"#REF!"}},{"$f":"+Zał.1_WPF_bazowy!#REF!","v":{"$error":"#REF!"}},{"$f":"+Zał.1_WPF_bazowy!#REF!","v":{"$error":"#REF!"}},{"$f":"+Zał.1_WPF_bazowy!#REF!","v":{"$error":"#REF!"}},{"$f":"+Zał.1_WPF_bazowy!#REF!","v":{"$error":"#REF!"}},{"$f":"+Zał.1_WPF_bazowy!#REF!","v":{"$error":"#REF!"}},{"$f":"+Zał.1_WPF_bazowy!#REF!","v":{"$error":"#REF!"}},{"$f":"+Zał.1_WPF_bazowy!#REF!","v":{"$error":"#REF!"}},{"$f":"+Zał.1_WPF_bazowy!#REF!","v":{"$error":"#REF!"}},{"$f":"+Zał.1_WPF_bazowy!#REF!","v":{"$error":"#REF!"}},{"$f":"+Zał.1_WPF_bazowy!#REF!","v":{"$error":"#REF!"}}]
["x","5.1.1.3",null,"kwota przypadających na dany rok kwot ustawowych wyłączeń innych niż określone w art. 243 ustawy",{"$f":"Zał.1_WPF_bazowy!E39","v":0},{"$f":"Zał.1_WPF_bazowy!F39","v":0},{"$f":"Zał.1_WPF_bazowy!G39","v":0},{"$f":"Zał.1_WPF_bazowy!H39","v":0},{"$f":"+Zał.1_WPF_bazowy!I39","v":0},{"$f":"+Zał.1_WPF_bazowy!J39","v":0},{"$f":"+Zał.1_WPF_bazowy!K39","v":0},{"$f":"+Zał.1_WPF_bazowy!L39","v":0},{"$f":"+Zał.1_WPF_bazowy!M39","v":0},{"$f":"+Zał.1_WPF_bazowy!N39","v":0},{"$f":"+Zał.1_WPF_bazowy!O39","v":0},{"$f":"+Zał.1_WPF_bazowy!P39","v":0},{"$f":"+Zał.1_WPF_bazowy!Q39","v":0},{"$f":"+Zał.1_WPF_bazowy!#REF!","v":{"$error":"#REF!"}},{"$f":"+Zał.1_WPF_bazowy!#REF!","v":{"$error":"#REF!"}},{"$f":"+Zał.1_WPF_bazowy!#REF!","v":{"$error":"#REF!"}},{"$f":"+Zał.1_WPF_bazowy!#REF!","v":{"$error":"#REF!"}},{"$f":"+Zał.1_WPF_bazowy!#REF!","v":{"$error":"#REF!"}},{"$f":"+Zał.1_WPF_bazowy!#REF!","v":{"$error":"#REF!"}},{"$f":"+Zał.1_WPF_bazowy!#REF!","v":{"$error":"#REF!"}},{"$f":"+Zał.1_WPF_bazowy!#REF!","v":{"$error":"#REF!"}},{"$f":"+Zał.1_WPF_bazowy!#REF!","v":{"$error":"#REF!"}},{"$f":"+Zał.1_WPF_bazowy!#REF!","v":{"$error":"#REF!"}},{"$f":"+Zał.1_WPF_bazowy!#REF!","v":{"$error":"#REF!"}},{"$f":"+Zał.1_WPF_bazowy!#REF!","v":{"$error":"#REF!"}},{"$f":"+Zał.1_WPF_bazowy!#REF!","v":{"$error":"#REF!"}},{"$f":"+Zał.1_WPF_bazowy!#REF!","v":{"$error":"#REF!"}},{"$f":"+Zał.1_WPF_bazowy!#REF!","v":{"$error":"#REF!"}},{"$f":"+Zał.1_WPF_bazowy!#REF!","v":{"$error":"#REF!"}},{"$f":"+Zał.1_WPF_bazowy!#REF!","v":{"$error":"#REF!"}},{"$f":"+Zał.1_WPF_bazowy!#REF!","v":{"$error":"#REF!"}},{"$f":"+Zał.1_WPF_bazowy!#REF!","v":{"$error":"#REF!"}},{"$f":"+Zał.1_WPF_bazowy!#REF!","v":{"$error":"#REF!"}},{"$f":"+Zał.1_WPF_bazowy!#REF!","v":{"$error":"#REF!"}}]
[null,"5.2",null," Inne rozchody niezwiązane ze spłatą długu",{"$f":"Zał.1_WPF_bazowy!E40","v":0},{"$f":"Zał.1_WPF_bazowy!F40","v":0},{"$f":"Zał.1_WPF_bazowy!G40","v":0},{"$f":"Zał.1_WPF_bazowy!H40","v":0},{"$f":"+Zał.1_WPF_bazowy!I40","v":0},{"$f":"+Zał.1_WPF_bazowy!J40","v":0},{"$f":"+Zał.1_WPF_bazowy!K40","v":0},{"$f":"+Zał.1_WPF_bazowy!L40","v":0},{"$f":"+Zał.1_WPF_bazowy!M40","v":0},{"$f":"+Zał.1_WPF_bazowy!N40","v":0},{"$f":"+Zał.1_WPF_bazowy!O40","v":0},{"$f":"+Zał.1_WPF_bazowy!P40","v":0},{"$f":"+Zał.1_WPF_bazowy!Q40","v":0},{"$f":"+Zał.1_WPF_bazowy!#REF!","v":{"$error":"#REF!"}},{"$f":"+Zał.1_WPF_bazowy!#REF!","v":{"$error":"#REF!"}},{"$f":"+Zał.1_WPF_bazowy!#REF!","v":{"$error":"#REF!"}},{"$f":"+Zał.1_WPF_bazowy!#REF!","v":{"$error":"#REF!"}},{"$f":"+Zał.1_WPF_bazowy!#REF!","v":{"$error":"#REF!"}},{"$f":"+Zał.1_WPF_bazowy!#REF!","v":{"$error":"#REF!"}},{"$f":"+Zał.1_WPF_bazowy!#REF!","v":{"$error":"#REF!"}},{"$f":"+Zał.1_WPF_bazowy!#REF!","v":{"$error":"#REF!"}},{"$f":"+Zał.1_WPF_bazowy!#REF!","v":{"$error":"#REF!"}},{"$f":"+Zał.1_WPF_bazowy!#REF!","v":{"$error":"#REF!"}},{"$f":"+Zał.1_WPF_bazowy!#REF!","v":{"$error":"#REF!"}},{"$f":"+Zał.1_WPF_bazowy!#REF!","v":{"$error":"#REF!"}},{"$f":"+Zał.1_WPF_bazowy!#REF!","v":{"$error":"#REF!"}},{"$f":"+Zał.1_WPF_bazowy!#REF!","v":{"$error":"#REF!"}},{"$f":"+Zał.1_WPF_bazowy!#REF!","v":{"$error":"#REF!"}},{"$f":"+Zał.1_WPF_bazowy!#REF!","v":{"$error":"#REF!"}},{"$f":"+Zał.1_WPF_bazowy!#REF!","v":{"$error":"#REF!"}},{"$f":"+Zał.1_WPF_bazowy!#REF!","v":{"$error":"#REF!"}},{"$f":"+Zał.1_WPF_bazowy!#REF!","v":{"$error":"#REF!"}},{"$f":"+Zał.1_WPF_bazowy!#REF!","v":{"$error":"#REF!"}},{"$f":"+Zał.1_WPF_bazowy!#REF!","v":{"$error":"#REF!"}}]
["x",6,null,"Kwota długu",{"$f":"Zał.1_WPF_bazowy!E41","v":15503368.16},{"$f":"Zał.1_WPF_bazowy!F41","v":15985808},{"$f":"Zał.1_WPF_bazowy!G41","v":17522808},{"$f":"Zał.1_WPF_bazowy!H41","v":17522808},{"$f":"+IF(I10<>0,H48+I37-I42+(I105-H105)+I110,0)","v":17522808},16044604,14366400,12506396,10296392,8086388,5836384,3418384,0,{"$error":"#REF!"},{"$error":"#REF!"},{"$error":"#REF!"},{"$error":"#REF!"},{"$error":"#REF!"},{"$error":"#REF!"},{"$error":"#REF!"},{"$error":"#REF!"},{"$error":"#REF!"},{"$error":"#REF!"},{"$error":"#REF!"},{"$error":"#REF!"},{"$error":"#REF!"},{"$error":"#REF!"},{"$error":"#REF!"},{"$error":"#REF!"},{"$error":"#REF!"},{"$error":"#REF!"},{"$error":"#REF!"},{"$error":"#REF!"},{"$error":"#REF!"}]
[null,7,null,"Kwota zobowiązań wynikających z przejęcia przez jednostkę samorządu terytorialnego zobowiązań po likwidowanych i przekształcanych jednostkach zaliczanych do sektora  finansów publicznych",{"$f":"Zał.1_WPF_bazowy!E42","v":0},{"$f":"Zał.1_WPF_bazowy!F42","v":0},{"$f":"Zał.1_WPF_bazowy!G42","v":0},{"$f":"Zał.1_WPF_bazowy!H42","v":0},{"$f":"+Zał.1_WPF_bazowy!I42","v":0},{"$f":"+Zał.1_WPF_bazowy!J42","v":0},{"$f":"+Zał.1_WPF_bazowy!K42","v":0},{"$f":"+Zał.1_WPF_bazowy!L42","v":0},{"$f":"+Zał.1_WPF_bazowy!M42","v":0},{"$f":"+Zał.1_WPF_bazowy!N42","v":0},{"$f":"+Zał.1_WPF_bazowy!O42","v":0},{"$f":"+Zał.1_WPF_bazowy!P42","v":0},{"$f":"+Zał.1_WPF_bazowy!Q42","v":0},{"$f":"+Zał.1_WPF_bazowy!#REF!","v":{"$error":"#REF!"}},{"$f":"+Zał.1_WPF_bazowy!#REF!","v":{"$error":"#REF!"}},{"$f":"+Zał.1_WPF_bazowy!#REF!","v":{"$error":"#REF!"}},{"$f":"+Zał.1_WPF_bazowy!#REF!","v":{"$error":"#REF!"}},{"$f":"+Zał.1_WPF_bazowy!#REF!","v":{"$error":"#REF!"}},{"$f":"+Zał.1_WPF_bazowy!#REF!","v":{"$error":"#REF!"}},{"$f":"+Zał.1_WPF_bazowy!#REF!","v":{"$error":"#REF!"}},{"$f":"+Zał.1_WPF_bazowy!#REF!","v":{"$error":"#REF!"}},{"$f":"+Zał.1_WPF_bazowy!#REF!","v":{"$error":"#REF!"}},{"$f":"+Zał.1_WPF_bazowy!#REF!","v":{"$error":"#REF!"}},{"$f":"+Zał.1_WPF_bazowy!#REF!","v":{"$error":"#REF!"}},{"$f":"+Zał.1_WPF_bazowy!#REF!","v":{"$error":"#REF!"}},{"$f":"+Zał.1_WPF_bazowy!#REF!","v":{"$error":"#REF!"}},{"$f":"+Zał.1_WPF_bazowy!#REF!","v":{"$error":"#REF!"}},{"$f":"+Zał.1_WPF_bazowy!#REF!","v":{"$error":"#REF!"}},{"$f":"+Zał.1_WPF_bazowy!#REF!","v":{"$error":"#REF!"}},{"$f":"+Zał.1_WPF_bazowy!#REF!","v":{"$error":"#REF!"}},{"$f":"+Zał.1_WPF_bazowy!#REF!","v":{"$error":"#REF!"}},{"$f":"+Zał.1_WPF_bazowy!#REF!","v":{"$error":"#REF!"}},{"$f":"+Zał.1_WPF_bazowy!#REF!","v":{"$error":"#REF!"}},{"$f":"+Zał.1_WPF_bazowy!#REF!","v":{"$error":"#REF!"}}]
[null,8,null,"Relacja zrównoważenia wydatków bieżących, o której mowa w art. 242 ustawy","x","x","x","x","x","x","x","x","x","x","x","x","x","x","x","x","x","x","x","x","x","x","x","x","x","x","x","x","x","x","x","x","x","x"]
[null,"8.1","[1.1] - [2.1]","Różnica między dochodami bieżącymi a  wydatkami bieżącymi",{"$f":"Zał.1_WPF_bazowy!E44","v":2126924.56},{"$f":"Zał.1_WPF_bazowy!F44","v":2820812.79},{"$f":"Zał.1_WPF_bazowy!G44","v":1779431.18},{"$f":"+H11-H22","v":1779431.1800000034},2234000,2900000,3400000,3900000,4400000,4900000,5400000,5900000,6400000,{"$error":"#REF!"},{"$error":"#REF!"},{"$error":"#REF!"},{"$error":"#REF!"},{"$error":"#REF!"},{"$error":"#REF!"},{"$error":"#REF!"},{"$error":"#REF!"},{"$error":"#REF!"},{"$error":"#REF!"},{"$error":"#REF!"},{"$error":"#REF!"},{"$error":"#REF!"},{"$error":"#REF!"},{"$error":"#REF!"},{"$error":"#REF!"},{"$error":"#REF!"},{"$error":"#REF!"},{"$error":"#REF!"},{"$error":"#REF!"},{"$error":"#REF!"}]
[null,"8.2","[1.1] + [4.1] + [4.2] - (  [2.1] - [2.1.2]  )","Różnica między dochodami bieżącymi, skorygowanymi o środki a wydatkami bieżącymi, pomniejszonymi  o wydatki",{"$f":"+IF(AND(E9>=2013,E9<=2015),+E11+E33+E35-(E22-E25),+E11+E33+E35-E22)","v":4734335.7800000049},5323250.3000000007,6172829.5600000061,6172829.5600000061,2234000,2900000,3400000,3900000,4400000,4900000,5400000,5900000,6400000,{"$error":"#REF!"},{"$error":"#REF!"},{"$error":"#REF!"},{"$error":"#REF!"},{"$error":"#REF!"},{"$error":"#REF!"},{"$error":"#REF!"},{"$error":"#REF!"},{"$error":"#REF!"},{"$error":"#REF!"},{"$error":"#REF!"},{"$error":"#REF!"},{"$error":"#REF!"},{"$error":"#REF!"},{"$error":"#REF!"},{"$error":"#REF!"},{"$error":"#REF!"},{"$error":"#REF!"},{"$error":"#REF!"},{"$error":"#REF!"},{"$error":"#REF!"}]
["x",9,null,"Wskaźnik spłaty zobowiązań","x","x","x","x","x","x","x","x","x","x","x","x","x","x","x","x","x","x","x","x","x","x","x","x","x","x","x","x","x","x","x","x","x","x"]
["x","9.1","([2.1.1] + [2.1.3.1] + [5.1] ) / [1]","Wskaźnik planowanej łącznej kwoty spłaty zobowiązań, o której mowa w art. 243 ust. 1 ustawy do dochodów, bez uwzględnienia zobowiązań związku współtworzonego przez jednostkę samorządu terytorialnego  i bez uwzględnienia ustawowych wyłączeń przypadających na dany rok.",{"$f":"Zał.1_WPF_bazowy!E47","v":6.9400000000000003E-2},{"$f":"Zał.1_WPF_bazowy!F47","v":6.6799999999999998E-2},{"$f":"Zał.1_WPF_bazowy!G47","v":3.8800000000000001E-2},{"$f":"+IF(H10<>0,ROUND((H23+H27+H42)/H10,$K$7+2),\"-\")","v":3.8800000000000001E-2},5.6800000000000003E-2,6.3200000000000006E-2,6.6400000000000001E-2,6.8900000000000003E-2,7.4999999999999997E-2,7.0900000000000005E-2,6.7799999999999999E-2,6.8400000000000002E-2,8.9399999999999993E-2,{"$error":"#REF!"},{"$error":"#REF!"},{"$error":"#REF!"},{"$error":"#REF!"},{"$error":"#REF!"},{"$error":"#REF!"},{"$error":"#REF!"},{"$error":"#REF!"},{"$error":"#REF!"},{"$error":"#REF!"},{"$error":"#REF!"},{"$error":"#REF!"},{"$error":"#REF!"},{"$error":"#REF!"},{"$error":"#REF!"},{"$error":"#REF!"},{"$error":"#REF!"},{"$error":"#REF!"},{"$error":"#REF!"},{"$error":"#REF!"},{"$error":"#REF!"}]
["x","9.2","( ([2.1.1]-[2.1.1.1])+([2.1.3.1]-[2.1.3.1.1]-[2.1.3.1.2])+([5.1]-[5.1.1]) )/([1]-[15.1.1])","Wskaźnik planowanej łącznej kwoty spłaty zobowiązań, o której mowa w art. 243 ust. 1 ustawy do dochodów, bez uwzględnienia zobowiązań związku współtworzonego przez jednostkę samorządu terytorialnego, po uwzględnieniu ustawowych wyłączeń przypadających na dany rok.",{"$f":"Zał.1_WPF_bazowy!E48","v":6.9400000000000003E-2},{"$f":"Zał.1_WPF_bazowy!F48","v":6.6799999999999998E-2},{"$f":"Zał.1_WPF_bazowy!G48","v":3.8800000000000001E-2},{"$f":"+IF(H10<>0,ROUND((H23-H24+H27-H28-H29+H42-H43)/(H10-H113),$K$7+2),\"-\")","v":3.8800000000000001E-2},{"$f":"+IF(I10<>0,ROUND((I23-I24+I27-I28-I29+I42-I43)/(I10-I113),$K$7+2),\"-\")","v":5.6800000000000003E-2},6.3200000000000006E-2,6.6400000000000001E-2,6.8900000000000003E-2,7.4999999999999997E-2,7.0900000000000005E-2,6.7799999999999999E-2,6.8400000000000002E-2,8.9399999999999993E-2,{"$error":"#REF!"},{"$error":"#REF!"},{"$error":"#REF!"},{"$error":"#REF!"},{"$error":"#REF!"},{"$error":"#REF!"},{"$error":"#REF!"},{"$error":"#REF!"},{"$error":"#REF!"},{"$error":"#REF!"},{"$error":"#REF!"},{"$error":"#REF!"},{"$error":"#REF!"},{"$error":"#REF!"},{"$error":"#REF!"},{"$error":"#REF!"},{"$error":"#REF!"},{"$error":"#REF!"},{"$error":"#REF!"},{"$error":"#REF!"},{"$error":"#REF!"}]
["x","9.3",null,"Kwota zobowiązań związku współtworzonego przez jednostkę samorządu terytorialnego przypadających do spłaty w danym roku budżetowym, podlegająca doliczeniu zgodnie z art. 244 ustawy",{"$f":"Zał.1_WPF_bazowy!E49","v":0},{"$f":"Zał.1_WPF_bazowy!F49","v":0},{"$f":"Zał.1_WPF_bazowy!G49","v":0},{"$f":"Zał.1_WPF_bazowy!H49","v":0},{"$f":"+Zał.1_WPF_bazowy!I49","v":0},{"$f":"+Zał.1_WPF_bazowy!J49","v":0},{"$f":"+Zał.1_WPF_bazowy!K49","v":0},{"$f":"+Zał.1_WPF_bazowy!L49","v":0},{"$f":"+Zał.1_WPF_bazowy!M49","v":0},{"$f":"+Zał.1_WPF_bazowy!N49","v":0},{"$f":"+Zał.1_WPF_bazowy!O49","v":0},{"$f":"+Zał.1_WPF_bazowy!P49","v":0},{"$f":"+Zał.1_WPF_bazowy!Q49","v":0},{"$f":"+Zał.1_WPF_bazowy!#REF!","v":{"$error":"#REF!"}},{"$f":"+Zał.1_WPF_bazowy!#REF!","v":{"$error":"#REF!"}},{"$f":"+Zał.1_WPF_bazowy!#REF!","v":{"$error":"#REF!"}},{"$f":"+Zał.1_WPF_bazowy!#REF!","v":{"$error":"#REF!"}},{"$f":"+Zał.1_WPF_bazowy!#REF!","v":{"$error":"#REF!"}},{"$f":"+Zał.1_WPF_bazowy!#REF!","v":{"$error":"#REF!"}},{"$f":"+Zał.1_WPF_bazowy!#REF!","v":{"$error":"#REF!"}},{"$f":"+Zał.1_WPF_bazowy!#REF!","v":{"$error":"#REF!"}},{"$f":"+Zał.1_WPF_bazowy!#REF!","v":{"$error":"#REF!"}},{"$f":"+Zał.1_WPF_bazowy!#REF!","v":{"$error":"#REF!"}},{"$f":"+Zał.1_WPF_bazowy!#REF!","v":{"$error":"#REF!"}},{"$f":"+Zał.1_WPF_bazowy!#REF!","v":{"$error":"#REF!"}},{"$f":"+Zał.1_WPF_bazowy!#REF!","v":{"$error":"#REF!"}},{"$f":"+Zał.1_WPF_bazowy!#REF!","v":{"$error":"#REF!"}},{"$f":"+Zał.1_WPF_bazowy!#REF!","v":{"$error":"#REF!"}},{"$f":"+Zał.1_WPF_bazowy!#REF!","v":{"$error":"#REF!"}},{"$f":"+Zał.1_WPF_bazowy!#REF!","v":{"$error":"#REF!"}},{"$f":"+Zał.1_WPF_bazowy!#REF!","v":{"$error":"#REF!"}},{"$f":"+Zał.1_WPF_bazowy!#REF!","v":{"$error":"#REF!"}},{"$f":"+Zał.1_WPF_bazowy!#REF!","v":{"$error":"#REF!"}},{"$f":"+Zał.1_WPF_bazowy!#REF!","v":{"$error":"#REF!"}}]
["x","9.4","(([2.1.1]-[2.1.1.1]) + ([2.1.3.1]-[2.1.3.1.1]-[2.1.3.1.2])+([5.1]-[5.1.1])+[9.3]) /([1]-[15.1.1])","Wskaźnik planowanej łącznej kwoty spłaty zobowiązań, o której mowa w art. 243 ust. 1 ustawy do dochodów, po uwzględnieniu zobowiązań związku współtworzonego przez jednostkę samorządu terytorialnego oraz po uwzględnieniu ustawowych wyłączeń przypadających na dany rok",{"$f":"Zał.1_WPF_bazowy!E50","v":6.9400000000000003E-2},{"$f":"Zał.1_WPF_bazowy!F50","v":6.6799999999999998E-2},{"$f":"Zał.1_WPF_bazowy!G50","v":3.8800000000000001E-2},{"$f":"+IF(H10<>0,ROUND((H23-H24+H27-H28-H29+H42-H43+H56)/(H10-H113),$K$7+2),\"-\")","v":3.8800000000000001E-2},{"$f":"+IF(I10<>0,ROUND((I23-I24+I27-I28-I29+I42-I43+I56)/(I10-I113),$K$7+2),\"-\")","v":5.6800000000000003E-2},6.3200000000000006E-2,6.6400000000000001E-2,6.8900000000000003E-2,7.4999999999999997E-2,7.0900000000000005E-2,6.7799999999999999E-2,6.8400000000000002E-2,8.9399999999999993E-2,{"$error":"#REF!"},{"$error":"#REF!"},{"$error":"#REF!"},{"$error":"#REF!"},{"$error":"#REF!"},{"$error":"#REF!"},{"$error":"#REF!"},{"$error":"#REF!"},{"$error":"#REF!"},{"$error":"#REF!"},{"$error":"#REF!"},{"$error":"#REF!"},{"$error":"#REF!"},{"$error":"#REF!"},{"$error":"#REF!"},{"$error":"#REF!"},{"$error":"#REF!"},{"$error":"#REF!"},{"$error":"#REF!"},{"$error":"#REF!"},{"$error":"#REF!"}]
["x","9.5","(([1.1] - [15.1.1])+[1.2.1] - ([2.1]-[2.1.2]-[15.2]))/ ([1]-[15.1.1])","Wskaźnik dochodów bieżących powiększonych o dochody ze sprzedaży majątku oraz pomniejszonych o wydatki bieżące, do dochodów budżetu, ustalony dla danego roku (wskaźnik jednoroczny)",{"$f":"+ROUND(IF(AND(E9>=2013,E9<=2018),IF(E10<>0,(E11-E113+E19-E22+E25+E114)/(E10-E113),0),IF(E10<>0,(E11-E113+E19-E22+E114)/(E10-E113),0)),$K$7+2)","v":6.3E-2},{"$f":"+ROUND(IF(AND(F9>=2013,F9<=2018),IF(F10<>0,(F11-F113+F19-F22+F25+F114)/(F10-F113),0),IF(F10<>0,(F11-F113+F19-F22+F114)/(F10-F113),0)),$K$7+2)","v":7.9000000000000001E-2},4.9299999999999997E-2,4.9299999999999997E-2,7.3200000000000001E-2,8.7599999999999997E-2,9.9699999999999997E-2,0.1111,0.12189999999999999,0.1321,0.14169999999999999,0.15090000000000001,0.15959999999999999,{"$error":"#REF!"},{"$error":"#REF!"},{"$error":"#REF!"},{"$error":"#REF!"},{"$error":"#REF!"},{"$error":"#REF!"},{"$error":"#REF!"},{"$error":"#REF!"},{"$error":"#REF!"},{"$error":"#REF!"},{"$error":"#REF!"},{"$error":"#REF!"},{"$error":"#REF!"},{"$error":"#REF!"},{"$error":"#REF!"},{"$error":"#REF!"},{"$error":"#REF!"},{"$error":"#REF!"},{"$error":"#REF!"},{"$error":"#REF!"},{"$error":"#REF!"}]
["x","9.6","średnia z trzech poprzednich lat [9.5]","Dopuszczalny wskaźnik spłaty zobowiązań określony w art. 243 ustawy, po uwzględnieniu ustawowych wyłączeń , obliczony w oparciu o plan 3 kwartału roku poprzedzającego pierwszy rok prognozy (wskaźnik ustalony w oparciu o średnią arytmetyczną z 3 poprzednich lat) ",{"$f":"Zał.1_WPF_bazowy!E52","v":"x"},{"$f":"Zał.1_WPF_bazowy!F52","v":"x"},{"$f":"Zał.1_WPF_bazowy!G52","v":"x"},{"$f":"Zał.1_WPF_bazowy!H52","v":"x"},{"$f":"+IF(I10<>0,(G58+F58+E58)/3,\"-\")","v":6.3766666666666666E-2},{"$f":"+IF(J10<>0,(I58+G58+F58)/3,\"-\")","v":6.7166666666666666E-2},{"$f":"+IF(K10<>0,(J58+I58+G58)/3,\"-\")","v":7.0033333333333336E-2},{"$f":"+IF(L10<>0,(K58+J58+I58)/3,\"-\")","v":8.6833333333333332E-2},9.9466666666666662E-2,0.1109,0.12169999999999999,0.13189999999999999,0.14156666666666665,{"$error":"#REF!"},{"$error":"#REF!"},{"$error":"#REF!"},{"$error":"#REF!"},{"$error":"#REF!"},{"$error":"#REF!"},{"$error":"#REF!"},{"$error":"#REF!"},{"$error":"#REF!"},{"$error":"#REF!"},{"$error":"#REF!"},{"$error":"#REF!"},{"$error":"#REF!"},{"$error":"#REF!"},{"$error":"#REF!"},{"$error":"#REF!"},{"$error":"#REF!"},{"$error":"#REF!"},{"$error":"#REF!"},{"$error":"#REF!"},{"$error":"#REF!"}]
["x","9.6.1","średnia z trzech poprzednich lat [9.5]","Dopuszczalny wskaźnik spłaty zobowiązań określony w art. 243 ustawy, po uwzględnieniu ustawowych wyłączeń, obliczony w oparciu o wykonanie roku poprzedzającego pierwszy rok prognozy (wskaźnik ustalony w oparciu o średnią arytmetyczną z 3 poprzednich lat) ",{"$f":"Zał.1_WPF_bazowy!E53","v":"x"},{"$f":"Zał.1_WPF_bazowy!F53","v":"x"},{"$f":"Zał.1_WPF_bazowy!G53","v":"x"},{"$f":"Zał.1_WPF_bazowy!H53","v":"x"},{"$f":"+IF(I10<>0,ROUND((H58+F58+E58)/3,$K$7+2),\"-\")","v":6.3799999999999996E-2},{"$f":"+IF(J10<>0,ROUND((I58+H58+F58)/3,$K$7+2),\"-\")","v":6.7199999999999996E-2},{"$f":"+IF(K10<>0,ROUND((J58+I58+H58)/3,$K$7+2),\"-\")","v":7.0000000000000007E-2},8.6800000000000002E-2,9.9500000000000005E-2,0.1109,0.1217,0.13189999999999999,0.1416,{"$error":"#REF!"},{"$error":"#REF!"},{"$error":"#REF!"},{"$error":"#REF!"},{"$error":"#REF!"},{"$error":"#REF!"},{"$error":"#REF!"},{"$error":"#REF!"},{"$error":"#REF!"},{"$error":"#REF!"},{"$error":"#REF!"},{"$error":"#REF!"},{"$error":"#REF!"},{"$error":"#REF!"},{"$error":"#REF!"},{"$error":"#REF!"},{"$error":"#REF!"},{"$error":"#REF!"},{"$error":"#REF!"},{"$error":"#REF!"},{"$error":"#REF!"}]
["x","9.7","[9.4]-[9.6]","Informacja o spełnieniu wskaźnika spłaty zobowiązań określonego w art. 243 ustawy, po uwzględnieniu zobowiązań związku współtworzonego przez jednostkę samorządu terytorialnego oraz po uwzględnieniu ustawowych wyłączeń, obliczonego w oparciu o plan 3 kwartałów roku poprzedzającego rok budżetowy",{"$f":"Zał.1_WPF_bazowy!E54","v":"x"},{"$f":"Zał.1_WPF_bazowy!F54","v":"x"},{"$f":"Zał.1_WPF_bazowy!G54","v":"x"},{"$f":"Zał.1_WPF_bazowy!H54","v":"x"},{"$f":"+IF(I10<>0,IF(I59>=I57,\"Spełniona\",\"Nie spełniona\"),\"-\")","v":"Spełniona"},"Spełniona","Spełniona","Spełniona","Spełniona","Spełniona","Spełniona","Spełniona","Spełniona",{"$error":"#REF!"},{"$error":"#REF!"},{"$error":"#REF!"},{"$error":"#REF!"},{"$error":"#REF!"},{"$error":"#REF!"},{"$error":"#REF!"},{"$error":"#REF!"},{"$error":"#REF!"},{"$error":"#REF!"},{"$error":"#REF!"},{"$error":"#REF!"},{"$error":"#REF!"},{"$error":"#REF!"},{"$error":"#REF!"},{"$error":"#REF!"},{"$error":"#REF!"},{"$error":"#REF!"},{"$error":"#REF!"},{"$error":"#REF!"},{"$error":"#REF!"}]
["x","9.7.1","[9.4]-[9.6.1]","Informacja o spełnieniu wskaźnika spłaty zobowiązań określonego w art. 243 ustawy, po uwzględnieniu zobowiązań związku współtworzonego przez jednostkę samorządu terytorialnego oraz po uwzględnieniu ustawowych wyłączeń, obliczonego w oparciu o wykonanie roku poprzedzającego rok budżetowy",{"$f":"Zał.1_WPF_bazowy!E55","v":"x"},{"$f":"Zał.1_WPF_bazowy!F55","v":"x"},{"$f":"Zał.1_WPF_bazowy!G55","v":"x"},{"$f":"Zał.1_WPF_bazowy!H55","v":"x"},{"$f":"+IF(I10<>0,IF(I60>=I57,\"Spełniona\",\"Nie spełniona\"),\"-\")","v":"Spełniona"},"Spełniona","Spełniona","Spełniona","Spełniona","Spełniona","Spełniona","Spełniona","Spełniona",{"$error":"#REF!"},{"$error":"#REF!"},{"$error":"#REF!"},{"$error":"#REF!"},{"$error":"#REF!"},{"$error":"#REF!"},{"$error":"#REF!"},{"$error":"#REF!"},{"$error":"#REF!"},{"$error":"#REF!"},{"$error":"#REF!"},{"$error":"#REF!"},{"$error":"#REF!"},{"$error":"#REF!"},{"$error":"#REF!"},{"$error":"#REF!"},{"$error":"#REF!"},{"$error":"#REF!"},{"$error":"#REF!"},{"$error":"#REF!"},{"$error":"#REF!"}]
[null,10,null,"Przeznaczenie prognozowanej nadwyżki budżetowej,  w tym na:",{"$f":"Zał.1_WPF_bazowy!E56","v":0},{"$f":"Zał.1_WPF_bazowy!F56","v":0},{"$f":"Zał.1_WPF_bazowy!G56","v":0},{"$f":"Zał.1_WPF_bazowy!H56","v":0},{"$f":"+Zał.1_WPF_bazowy!I56","v":0},{"$f":"+Zał.1_WPF_bazowy!J56","v":1478204},{"$f":"+Zał.1_WPF_bazowy!K56","v":1678204},{"$f":"+Zał.1_WPF_bazowy!L56","v":1860004},{"$f":"+Zał.1_WPF_bazowy!M56","v":2210004},{"$f":"+Zał.1_WPF_bazowy!N56","v":2210004},{"$f":"+Zał.1_WPF_bazowy!O56","v":2250004},{"$f":"+Zał.1_WPF_bazowy!P56","v":2418000},{"$f":"+Zał.1_WPF_bazowy!Q56","v":3418384},{"$f":"+Zał.1_WPF_bazowy!#REF!","v":{"$error":"#REF!"}},{"$f":"+Zał.1_WPF_bazowy!#REF!","v":{"$error":"#REF!"}},{"$f":"+Zał.1_WPF_bazowy!#REF!","v":{"$error":"#REF!"}},{"$f":"+Zał.1_WPF_bazowy!#REF!","v":{"$error":"#REF!"}},{"$f":"+Zał.1_WPF_bazowy!#REF!","v":{"$error":"#REF!"}},{"$f":"+Zał.1_WPF_bazowy!#REF!","v":{"$error":"#REF!"}},{"$f":"+Zał.1_WPF_bazowy!#REF!","v":{"$error":"#REF!"}},{"$f":"+Zał.1_WPF_bazowy!#REF!","v":{"$error":"#REF!"}},{"$f":"+Zał.1_WPF_bazowy!#REF!","v":{"$error":"#REF!"}},{"$f":"+Zał.1_WPF_bazowy!#REF!","v":{"$error":"#REF!"}},{"$f":"+Zał.1_WPF_bazowy!#REF!","v":{"$error":"#REF!"}},{"$f":"+Zał.1_WPF_bazowy!#REF!","v":{"$error":"#REF!"}},{"$f":"+Zał.1_WPF_bazowy!#REF!","v":{"$error":"#REF!"}},{"$f":"+Zał.1_WPF_bazowy!#REF!","v":{"$error":"#REF!"}},{"$f":"+Zał.1_WPF_bazowy!#REF!","v":{"$error":"#REF!"}},{"$f":"+Zał.1_WPF_bazowy!#REF!","v":{"$error":"#REF!"}},{"$f":"+Zał.1_WPF_bazowy!#REF!","v":{"$error":"#REF!"}},{"$f":"+Zał.1_WPF_bazowy!#REF!","v":{"$error":"#REF!"}},{"$f":"+Zał.1_WPF_bazowy!#REF!","v":{"$error":"#REF!"}},{"$f":"+Zał.1_WPF_bazowy!#REF!","v":{"$error":"#REF!"}},{"$f":"+Zał.1_WPF_bazowy!#REF!","v":{"$error":"#REF!"}}]
[null,"10.1",null,"Spłaty kredytów, pożyczek i wykup papierów wartościowych",{"$f":"Zał.1_WPF_bazowy!E57","v":0},{"$f":"Zał.1_WPF_bazowy!F57","v":0},{"$f":"Zał.1_WPF_bazowy!G57","v":0},{"$f":"Zał.1_WPF_bazowy!H57","v":0},{"$f":"+Zał.1_WPF_bazowy!I57","v":0},{"$f":"+Zał.1_WPF_bazowy!J57","v":1478204},{"$f":"+Zał.1_WPF_bazowy!K57","v":1678204},{"$f":"+Zał.1_WPF_bazowy!L57","v":1860004},{"$f":"+Zał.1_WPF_bazowy!M57","v":2210004},{"$f":"+Zał.1_WPF_bazowy!N57","v":2210004},{"$f":"+Zał.1_WPF_bazowy!O57","v":2250004},{"$f":"+Zał.1_WPF_bazowy!P57","v":2418000},{"$f":"+Zał.1_WPF_bazowy!Q57","v":3418384},{"$f":"+Zał.1_WPF_bazowy!#REF!","v":{"$error":"#REF!"}},{"$f":"+Zał.1_WPF_bazowy!#REF!","v":{"$error":"#REF!"}},{"$f":"+Zał.1_WPF_bazowy!#REF!","v":{"$error":"#REF!"}},{"$f":"+Zał.1_WPF_bazowy!#REF!","v":{"$error":"#REF!"}},{"$f":"+Zał.1_WPF_bazowy!#REF!","v":{"$error":"#REF!"}},{"$f":"+Zał.1_WPF_bazowy!#REF!","v":{"$error":"#REF!"}},{"$f":"+Zał.1_WPF_bazowy!#REF!","v":{"$error":"#REF!"}},{"$f":"+Zał.1_WPF_bazowy!#REF!","v":{"$error":"#REF!"}},{"$f":"+Zał.1_WPF_bazowy!#REF!","v":{"$error":"#REF!"}},{"$f":"+Zał.1_WPF_bazowy!#REF!","v":{"$error":"#REF!"}},{"$f":"+Zał.1_WPF_bazowy!#REF!","v":{"$error":"#REF!"}},{"$f":"+Zał.1_WPF_bazowy!#REF!","v":{"$error":"#REF!"}},{"$f":"+Zał.1_WPF_bazowy!#REF!","v":{"$error":"#REF!"}},{"$f":"+Zał.1_WPF_bazowy!#REF!","v":{"$error":"#REF!"}},{"$f":"+Zał.1_WPF_bazowy!#REF!","v":{"$error":"#REF!"}},{"$f":"+Zał.1_WPF_bazowy!#REF!","v":{"$error":"#REF!"}},{"$f":"+Zał.1_WPF_bazowy!#REF!","v":{"$error":"#REF!"}},{"$f":"+Zał.1_WPF_bazowy!#REF!","v":{"$error":"#REF!"}},{"$f":"+Zał.1_WPF_bazowy!#REF!","v":{"$error":"#REF!"}},{"$f":"+Zał.1_WPF_bazowy!#REF!","v":{"$error":"#REF!"}},{"$f":"+Zał.1_WPF_bazowy!#REF!","v":{"$error":"#REF!"}}]
[null,11,null,"Informacje uzupełniające o wybranych rodzajach wydatków budżetowych","x","x","x","x","x","x","x","x","x","x","x","x","x","x","x","x","x","x","x","x","x","x","x","x","x","x","x","x","x","x","x","x","x","x"]
[null,"11.1",null,"Wydatki bieżące na wynagrodzenia i składki od nich naliczane",{"$f":"Zał.1_WPF_bazowy!E59","v":12368065.33},{"$f":"Zał.1_WPF_bazowy!F59","v":12844686.27},{"$f":"Zał.1_WPF_bazowy!G59","v":13946795.57},{"$f":"Zał.1_WPF_bazowy!H59","v":13946795.57},{"$f":"+Zał.1_WPF_bazowy!I59","v":14764410},{"$f":"+Zał.1_WPF_bazowy!J59","v":15000000},{"$f":"+Zał.1_WPF_bazowy!K59","v":15300000},{"$f":"+Zał.1_WPF_bazowy!L59","v":15600000},{"$f":"+Zał.1_WPF_bazowy!M59","v":0},{"$f":"+Zał.1_WPF_bazowy!N59","v":0},{"$f":"+Zał.1_WPF_bazowy!O59","v":0},{"$f":"+Zał.1_WPF_bazowy!P59","v":0},{"$f":"+Zał.1_WPF_bazowy!Q59","v":0},{"$f":"+Zał.1_WPF_bazowy!#REF!","v":{"$error":"#REF!"}},{"$f":"+Zał.1_WPF_bazowy!#REF!","v":{"$error":"#REF!"}},{"$f":"+Zał.1_WPF_bazowy!#REF!","v":{"$error":"#REF!"}},{"$f":"+Zał.1_WPF_bazowy!#REF!","v":{"$error":"#REF!"}},{"$f":"+Zał.1_WPF_bazowy!#REF!","v":{"$error":"#REF!"}},{"$f":"+Zał.1_WPF_bazowy!#REF!","v":{"$error":"#REF!"}},{"$f":"+Zał.1_WPF_bazowy!#REF!","v":{"$error":"#REF!"}},{"$f":"+Zał.1_WPF_bazowy!#REF!","v":{"$error":"#REF!"}},{"$f":"+Zał.1_WPF_bazowy!#REF!","v":{"$error":"#REF!"}},{"$f":"+Zał.1_WPF_bazowy!#REF!","v":{"$error":"#REF!"}},{"$f":"+Zał.1_WPF_bazowy!#REF!","v":{"$error":"#REF!"}},{"$f":"+Zał.1_WPF_bazowy!#REF!","v":{"$error":"#REF!"}},{"$f":"+Zał.1_WPF_bazowy!#REF!","v":{"$error":"#REF!"}},{"$f":"+Zał.1_WPF_bazowy!#REF!","v":{"$error":"#REF!"}},{"$f":"+Zał.1_WPF_bazowy!#REF!","v":{"$error":"#REF!"}},{"$f":"+Zał.1_WPF_bazowy!#REF!","v":{"$error":"#REF!"}},{"$f":"+Zał.1_WPF_bazowy!#REF!","v":{"$error":"#REF!"}},{"$f":"+Zał.1_WPF_bazowy!#REF!","v":{"$error":"#REF!"}},{"$f":"+Zał.1_WPF_bazowy!#REF!","v":{"$error":"#REF!"}},{"$f":"+Zał.1_WPF_bazowy!#REF!","v":{"$error":"#REF!"}},{"$f":"+Zał.1_WPF_bazowy!#REF!","v":{"$error":"#REF!"}}]
[null,"11.2",null,"Wydatki związane z funkcjonowaniem organów jednostki samorządu terytorialnego",{"$f":"Zał.1_WPF_bazowy!E60","v":2986207.91},{"$f":"Zał.1_WPF_bazowy!F60","v":3073324.39},{"$f":"Zał.1_WPF_bazowy!G60","v":3391850},{"$f":"Zał.1_WPF_bazowy!H60","v":3391850},{"$f":"+Zał.1_WPF_bazowy!I60","v":3427000},{"$f":"+Zał.1_WPF_bazowy!J60","v":3450000},{"$f":"+Zał.1_WPF_bazowy!K60","v":3500000},{"$f":"+Zał.1_WPF_bazowy!L60","v":3550000},{"$f":"+Zał.1_WPF_bazowy!M60","v":0},{"$f":"+Zał.1_WPF_bazowy!N60","v":0},{"$f":"+Zał.1_WPF_bazowy!O60","v":0},{"$f":"+Zał.1_WPF_bazowy!P60","v":0},{"$f":"+Zał.1_WPF_bazowy!Q60","v":0},{"$f":"+Zał.1_WPF_bazowy!#REF!","v":{"$error":"#REF!"}},{"$f":"+Zał.1_WPF_bazowy!#REF!","v":{"$error":"#REF!"}},{"$f":"+Zał.1_WPF_bazowy!#REF!","v":{"$error":"#REF!"}},{"$f":"+Zał.1_WPF_bazowy!#REF!","v":{"$error":"#REF!"}},{"$f":"+Zał.1_WPF_bazowy!#REF!","v":{"$error":"#REF!"}},{"$f":"+Zał.1_WPF_bazowy!#REF!","v":{"$error":"#REF!"}},{"$f":"+Zał.1_WPF_bazowy!#REF!","v":{"$error":"#REF!"}},{"$f":"+Zał.1_WPF_bazowy!#REF!","v":{"$error":"#REF!"}},{"$f":"+Zał.1_WPF_bazowy!#REF!","v":{"$error":"#REF!"}},{"$f":"+Zał.1_WPF_bazowy!#REF!","v":{"$error":"#REF!"}},{"$f":"+Zał.1_WPF_bazowy!#REF!","v":{"$error":"#REF!"}},{"$f":"+Zał.1_WPF_bazowy!#REF!","v":{"$error":"#REF!"}},{"$f":"+Zał.1_WPF_bazowy!#REF!","v":{"$error":"#REF!"}},{"$f":"+Zał.1_WPF_bazowy!#REF!","v":{"$error":"#REF!"}},{"$f":"+Zał.1_WPF_bazowy!#REF!","v":{"$error":"#REF!"}},{"$f":"+Zał.1_WPF_bazowy!#REF!","v":{"$error":"#REF!"}},{"$f":"+Zał.1_WPF_bazowy!#REF!","v":{"$error":"#REF!"}},{"$f":"+Zał.1_WPF_bazowy!#REF!","v":{"$error":"#REF!"}},{"$f":"+Zał.1_WPF_bazowy!#REF!","v":{"$error":"#REF!"}},{"$f":"+Zał.1_WPF_bazowy!#REF!","v":{"$error":"#REF!"}},{"$f":"+Zał.1_WPF_bazowy!#REF!","v":{"$error":"#REF!"}}]
[null,"11.3","[11.3.1] + [11.3.2]","Wydatki objęte limitem, o którym mowa w art. 226 ust. 3 pkt 4 ustawy",{"$f":"Zał.1_WPF_bazowy!E61","v":2706336.15},{"$f":"Zał.1_WPF_bazowy!F61","v":1320685.6299999999},{"$f":"Zał.1_WPF_bazowy!G61","v":1521985.68},{"$f":"+H69+H70","v":1521985.68},{"$f":"+I69+I70","v":847280},{"$f":"+J69+J70","v":1314520},600000,0,0,0,0,0,0,{"$error":"#REF!"},{"$error":"#REF!"},{"$error":"#REF!"},{"$error":"#REF!"},{"$error":"#REF!"},{"$error":"#REF!"},{"$error":"#REF!"},{"$error":"#REF!"},{"$error":"#REF!"},{"$error":"#REF!"},{"$error":"#REF!"},{"$error":"#REF!"},{"$error":"#REF!"},{"$error":"#REF!"},{"$error":"#REF!"},{"$error":"#REF!"},{"$error":"#REF!"},{"$error":"#REF!"},{"$error":"#REF!"},{"$error":"#REF!"},{"$error":"#REF!"}]
[null,"11.3.1",null,"bieżące",{"$f":"Zał.1_WPF_bazowy!E62","v":885100.65},{"$f":"Zał.1_WPF_bazowy!F62","v":1182848.52},{"$f":"Zał.1_WPF_bazowy!G62","v":1421985.68},{"$f":"Zał.1_WPF_bazowy!H62","v":1421985.68},{"$f":"+Zał.1_WPF_bazowy!I62","v":3280},{"$f":"+Zał.1_WPF_bazowy!J62","v":5520},{"$f":"+Zał.1_WPF_bazowy!K62","v":0},{"$f":"+Zał.1_WPF_bazowy!L62","v":0},{"$f":"+Zał.1_WPF_bazowy!M62","v":0},{"$f":"+Zał.1_WPF_bazowy!N62","v":0},{"$f":"+Zał.1_WPF_bazowy!O62","v":0},{"$f":"+Zał.1_WPF_bazowy!P62","v":0},{"$f":"+Zał.1_WPF_bazowy!Q62","v":0},{"$f":"+Zał.1_WPF_bazowy!#REF!","v":{"$error":"#REF!"}},{"$f":"+Zał.1_WPF_bazowy!#REF!","v":{"$error":"#REF!"}},{"$f":"+Zał.1_WPF_bazowy!#REF!","v":{"$error":"#REF!"}},{"$f":"+Zał.1_WPF_bazowy!#REF!","v":{"$error":"#REF!"}},{"$f":"+Zał.1_WPF_bazowy!#REF!","v":{"$error":"#REF!"}},{"$f":"+Zał.1_WPF_bazowy!#REF!","v":{"$error":"#REF!"}},{"$f":"+Zał.1_WPF_bazowy!#REF!","v":{"$error":"#REF!"}},{"$f":"+Zał.1_WPF_bazowy!#REF!","v":{"$error":"#REF!"}},{"$f":"+Zał.1_WPF_bazowy!#REF!","v":{"$error":"#REF!"}},{"$f":"+Zał.1_WPF_bazowy!#REF!","v":{"$error":"#REF!"}},{"$f":"+Zał.1_WPF_bazowy!#REF!","v":{"$error":"#REF!"}},{"$f":"+Zał.1_WPF_bazowy!#REF!","v":{"$error":"#REF!"}},{"$f":"+Zał.1_WPF_bazowy!#REF!","v":{"$error":"#REF!"}},{"$f":"+Zał.1_WPF_bazowy!#REF!","v":{"$error":"#REF!"}},{"$f":"+Zał.1_WPF_bazowy!#REF!","v":{"$error":"#REF!"}},{"$f":"+Zał.1_WPF_bazowy!#REF!","v":{"$error":"#REF!"}},{"$f":"+Zał.1_WPF_bazowy!#REF!","v":{"$error":"#REF!"}},{"$f":"+Zał.1_WPF_bazowy!#REF!","v":{"$error":"#REF!"}},{"$f":"+Zał.1_WPF_bazowy!#REF!","v":{"$error":"#REF!"}},{"$f":"+Zał.1_WPF_bazowy!#REF!","v":{"$error":"#REF!"}},{"$f":"+Zał.1_WPF_bazowy!#REF!","v":{"$error":"#REF!"}}]
[null,"11.3.2",null,"majątkowe",{"$f":"Zał.1_WPF_bazowy!E63","v":1821235.5},{"$f":"Zał.1_WPF_bazowy!F63","v":137837.10999999999},{"$f":"Zał.1_WPF_bazowy!G63","v":100000},{"$f":"Zał.1_WPF_bazowy!H63","v":100000},{"$f":"+Zał.1_WPF_bazowy!I63","v":844000},{"$f":"+Zał.1_WPF_bazowy!J63","v":1309000},{"$f":"+Zał.1_WPF_bazowy!K63","v":600000},{"$f":"+Zał.1_WPF_bazowy!L63","v":0},{"$f":"+Zał.1_WPF_bazowy!M63","v":0},{"$f":"+Zał.1_WPF_bazowy!N63","v":0},{"$f":"+Zał.1_WPF_bazowy!O63","v":0},{"$f":"+Zał.1_WPF_bazowy!P63","v":0},{"$f":"+Zał.1_WPF_bazowy!Q63","v":0},{"$f":"+Zał.1_WPF_bazowy!#REF!","v":{"$error":"#REF!"}},{"$f":"+Zał.1_WPF_bazowy!#REF!","v":{"$error":"#REF!"}},{"$f":"+Zał.1_WPF_bazowy!#REF!","v":{"$error":"#REF!"}},{"$f":"+Zał.1_WPF_bazowy!#REF!","v":{"$error":"#REF!"}},{"$f":"+Zał.1_WPF_bazowy!#REF!","v":{"$error":"#REF!"}},{"$f":"+Zał.1_WPF_bazowy!#REF!","v":{"$error":"#REF!"}},{"$f":"+Zał.1_WPF_bazowy!#REF!","v":{"$error":"#REF!"}},{"$f":"+Zał.1_WPF_bazowy!#REF!","v":{"$error":"#REF!"}},{"$f":"+Zał.1_WPF_bazowy!#REF!","v":{"$error":"#REF!"}},{"$f":"+Zał.1_WPF_bazowy!#REF!","v":{"$error":"#REF!"}},{"$f":"+Zał.1_WPF_bazowy!#REF!","v":{"$error":"#REF!"}},{"$f":"+Zał.1_WPF_bazowy!#REF!","v":{"$error":"#REF!"}},{"$f":"+Zał.1_WPF_bazowy!#REF!","v":{"$error":"#REF!"}},{"$f":"+Zał.1_WPF_bazowy!#REF!","v":{"$error":"#REF!"}},{"$f":"+Zał.1_WPF_bazowy!#REF!","v":{"$error":"#REF!"}},{"$f":"+Zał.1_WPF_bazowy!#REF!","v":{"$error":"#REF!"}},{"$f":"+Zał.1_WPF_bazowy!#REF!","v":{"$error":"#REF!"}},{"$f":"+Zał.1_WPF_bazowy!#REF!","v":{"$error":"#REF!"}},{"$f":"+Zał.1_WPF_bazowy!#REF!","v":{"$error":"#REF!"}},{"$f":"+Zał.1_WPF_bazowy!#REF!","v":{"$error":"#REF!"}},{"$f":"+Zał.1_WPF_bazowy!#REF!","v":{"$error":"#REF!"}}]
[null,"11.4",null,"Wydatki inwestycyjne kontynuowane ",{"$f":"Zał.1_WPF_bazowy!E64","v":4829267.54},{"$f":"Zał.1_WPF_bazowy!F64","v":2958206},{"$f":"Zał.1_WPF_bazowy!G64","v":6615873},{"$f":"Zał.1_WPF_bazowy!H64","v":6615873},{"$f":"+Zał.1_WPF_bazowy!I64","v":1564000},{"$f":"+Zał.1_WPF_bazowy!J64","v":0},{"$f":"+Zał.1_WPF_bazowy!K64","v":0},{"$f":"+Zał.1_WPF_bazowy!L64","v":0},{"$f":"+Zał.1_WPF_bazowy!M64","v":0},{"$f":"+Zał.1_WPF_bazowy!N64","v":0},{"$f":"+Zał.1_WPF_bazowy!O64","v":0},{"$f":"+Zał.1_WPF_bazowy!P64","v":0},{"$f":"+Zał.1_WPF_bazowy!Q64","v":0},{"$f":"+Zał.1_WPF_bazowy!#REF!","v":{"$error":"#REF!"}},{"$f":"+Zał.1_WPF_bazowy!#REF!","v":{"$error":"#REF!"}},{"$f":"+Zał.1_WPF_bazowy!#REF!","v":{"$error":"#REF!"}},{"$f":"+Zał.1_WPF_bazowy!#REF!","v":{"$error":"#REF!"}},{"$f":"+Zał.1_WPF_bazowy!#REF!","v":{"$error":"#REF!"}},{"$f":"+Zał.1_WPF_bazowy!#REF!","v":{"$error":"#REF!"}},{"$f":"+Zał.1_WPF_bazowy!#REF!","v":{"$error":"#REF!"}},{"$f":"+Zał.1_WPF_bazowy!#REF!","v":{"$error":"#REF!"}},{"$f":"+Zał.1_WPF_bazowy!#REF!","v":{"$error":"#REF!"}},{"$f":"+Zał.1_WPF_bazowy!#REF!","v":{"$error":"#REF!"}},{"$f":"+Zał.1_WPF_bazowy!#REF!","v":{"$error":"#REF!"}},{"$f":"+Zał.1_WPF_bazowy!#REF!","v":{"$error":"#REF!"}},{"$f":"+Zał.1_WPF_bazowy!#REF!","v":{"$error":"#REF!"}},{"$f":"+Zał.1_WPF_bazowy!#REF!","v":{"$error":"#REF!"}},{"$f":"+Zał.1_WPF_bazowy!#REF!","v":{"$error":"#REF!"}},{"$f":"+Zał.1_WPF_bazowy!#REF!","v":{"$error":"#REF!"}},{"$f":"+Zał.1_WPF_bazowy!#REF!","v":{"$error":"#REF!"}},{"$f":"+Zał.1_WPF_bazowy!#REF!","v":{"$error":"#REF!"}},{"$f":"+Zał.1_WPF_bazowy!#REF!","v":{"$error":"#REF!"}},{"$f":"+Zał.1_WPF_bazowy!#REF!","v":{"$error":"#REF!"}},{"$f":"+Zał.1_WPF_bazowy!#REF!","v":{"$error":"#REF!"}}]
[null,"11.5",null,"Nowe wydatki inwestycyjne",{"$f":"Zał.1_WPF_bazowy!E65","v":1680528.06},{"$f":"Zał.1_WPF_bazowy!F65","v":2364458.2000000002},{"$f":"Zał.1_WPF_bazowy!G65","v":2967100},{"$f":"Zał.1_WPF_bazowy!H65","v":2967100},{"$f":"+Zał.1_WPF_bazowy!I65","v":520000},{"$f":"+Zał.1_WPF_bazowy!J65","v":0},{"$f":"+Zał.1_WPF_bazowy!K65","v":0},{"$f":"+Zał.1_WPF_bazowy!L65","v":0},{"$f":"+Zał.1_WPF_bazowy!M65","v":0},{"$f":"+Zał.1_WPF_bazowy!N65","v":0},{"$f":"+Zał.1_WPF_bazowy!O65","v":0},{"$f":"+Zał.1_WPF_bazowy!P65","v":0},{"$f":"+Zał.1_WPF_bazowy!Q65","v":0},{"$f":"+Zał.1_WPF_bazowy!#REF!","v":{"$error":"#REF!"}},{"$f":"+Zał.1_WPF_bazowy!#REF!","v":{"$error":"#REF!"}},{"$f":"+Zał.1_WPF_bazowy!#REF!","v":{"$error":"#REF!"}},{"$f":"+Zał.1_WPF_bazowy!#REF!","v":{"$error":"#REF!"}},{"$f":"+Zał.1_WPF_bazowy!#REF!","v":{"$error":"#REF!"}},{"$f":"+Zał.1_WPF_bazowy!#REF!","v":{"$error":"#REF!"}},{"$f":"+Zał.1_WPF_bazowy!#REF!","v":{"$error":"#REF!"}},{"$f":"+Zał.1_WPF_bazowy!#REF!","v":{"$error":"#REF!"}},{"$f":"+Zał.1_WPF_bazowy!#REF!","v":{"$error":"#REF!"}},{"$f":"+Zał.1_WPF_bazowy!#REF!","v":{"$error":"#REF!"}},{"$f":"+Zał.1_WPF_bazowy!#REF!","v":{"$error":"#REF!"}},{"$f":"+Zał.1_WPF_bazowy!#REF!","v":{"$error":"#REF!"}},{"$f":"+Zał.1_WPF_bazowy!#REF!","v":{"$error":"#REF!"}},{"$f":"+Zał.1_WPF_bazowy!#REF!","v":{"$error":"#REF!"}},{"$f":"+Zał.1_WPF_bazowy!#REF!","v":{"$error":"#REF!"}},{"$f":"+Zał.1_WPF_bazowy!#REF!","v":{"$error":"#REF!"}},{"$f":"+Zał.1_WPF_bazowy!#REF!","v":{"$error":"#REF!"}},{"$f":"+Zał.1_WPF_bazowy!#REF!","v":{"$error":"#REF!"}},{"$f":"+Zał.1_WPF_bazowy!#REF!","v":{"$error":"#REF!"}},{"$f":"+Zał.1_WPF_bazowy!#REF!","v":{"$error":"#REF!"}},{"$f":"+Zał.1_WPF_bazowy!#REF!","v":{"$error":"#REF!"}}]
[null,"11.6",null,"Wydatki majątkowe w formie dotacji ",{"$f":"Zał.1_WPF_bazowy!E66","v":319894},{"$f":"Zał.1_WPF_bazowy!F66","v":458831},{"$f":"Zał.1_WPF_bazowy!G66","v":636400},{"$f":"Zał.1_WPF_bazowy!H66","v":636400},{"$f":"+Zał.1_WPF_bazowy!I66","v":50000},{"$f":"+Zał.1_WPF_bazowy!J66","v":0},{"$f":"+Zał.1_WPF_bazowy!K66","v":0},{"$f":"+Zał.1_WPF_bazowy!L66","v":0},{"$f":"+Zał.1_WPF_bazowy!M66","v":0},{"$f":"+Zał.1_WPF_bazowy!N66","v":0},{"$f":"+Zał.1_WPF_bazowy!O66","v":0},{"$f":"+Zał.1_WPF_bazowy!P66","v":0},{"$f":"+Zał.1_WPF_bazowy!Q66","v":0},{"$f":"+Zał.1_WPF_bazowy!#REF!","v":{"$error":"#REF!"}},{"$f":"+Zał.1_WPF_bazowy!#REF!","v":{"$error":"#REF!"}},{"$f":"+Zał.1_WPF_bazowy!#REF!","v":{"$error":"#REF!"}},{"$f":"+Zał.1_WPF_bazowy!#REF!","v":{"$error":"#REF!"}},{"$f":"+Zał.1_WPF_bazowy!#REF!","v":{"$error":"#REF!"}},{"$f":"+Zał.1_WPF_bazowy!#REF!","v":{"$error":"#REF!"}},{"$f":"+Zał.1_WPF_bazowy!#REF!","v":{"$error":"#REF!"}},{"$f":"+Zał.1_WPF_bazowy!#REF!","v":{"$error":"#REF!"}},{"$f":"+Zał.1_WPF_bazowy!#REF!","v":{"$error":"#REF!"}},{"$f":"+Zał.1_WPF_bazowy!#REF!","v":{"$error":"#REF!"}},{"$f":"+Zał.1_WPF_bazowy!#REF!","v":{"$error":"#REF!"}},{"$f":"+Zał.1_WPF_bazowy!#REF!","v":{"$error":"#REF!"}},{"$f":"+Zał.1_WPF_bazowy!#REF!","v":{"$error":"#REF!"}},{"$f":"+Zał.1_WPF_bazowy!#REF!","v":{"$error":"#REF!"}},{"$f":"+Zał.1_WPF_bazowy!#REF!","v":{"$error":"#REF!"}},{"$f":"+Zał.1_WPF_bazowy!#REF!","v":{"$error":"#REF!"}},{"$f":"+Zał.1_WPF_bazowy!#REF!","v":{"$error":"#REF!"}},{"$f":"+Zał.1_WPF_bazowy!#REF!","v":{"$error":"#REF!"}},{"$f":"+Zał.1_WPF_bazowy!#REF!","v":{"$error":"#REF!"}},{"$f":"+Zał.1_WPF_bazowy!#REF!","v":{"$error":"#REF!"}},{"$f":"+Zał.1_WPF_bazowy!#REF!","v":{"$error":"#REF!"}}]
[null,12,null,"Finansowanie programów, projektów lub zadań realizowanych z udziałem środków, o których mowa w art. 5 ust. 1 pkt 2 i 3 ustawy","x","x","x","x","x","x","x","x","x","x","x","x","x","x","x","x","x","x","x","x","x","x","x","x","x","x","x","x","x","x","x","x","x","x"]
[null,"12.1",null,"Dochody bieżące  na programy, projekty lub zadania finansowane z udziałem środków, o których mowa w art. 5 ust. 1 pkt 2 i 3 ustawy",{"$f":"Zał.1_WPF_bazowy!E68","v":1650681.03},{"$f":"Zał.1_WPF_bazowy!F68","v":2512141.17},{"$f":"Zał.1_WPF_bazowy!G68","v":1035267.09},{"$f":"Zał.1_WPF_bazowy!H68","v":1035267.09},{"$f":"+Zał.1_WPF_bazowy!I68","v":0},{"$f":"+Zał.1_WPF_bazowy!J68","v":0},{"$f":"+Zał.1_WPF_bazowy!K68","v":0},{"$f":"+Zał.1_WPF_bazowy!L68","v":0},{"$f":"+Zał.1_WPF_bazowy!M68","v":0},{"$f":"+Zał.1_WPF_bazowy!N68","v":0},{"$f":"+Zał.1_WPF_bazowy!O68","v":0},{"$f":"+Zał.1_WPF_bazowy!P68","v":0},{"$f":"+Zał.1_WPF_bazowy!Q68","v":0},{"$f":"+Zał.1_WPF_bazowy!#REF!","v":{"$error":"#REF!"}},{"$f":"+Zał.1_WPF_bazowy!#REF!","v":{"$error":"#REF!"}},{"$f":"+Zał.1_WPF_bazowy!#REF!","v":{"$error":"#REF!"}},{"$f":"+Zał.1_WPF_bazowy!#REF!","v":{"$error":"#REF!"}},{"$f":"+Zał.1_WPF_bazowy!#REF!","v":{"$error":"#REF!"}},{"$f":"+Zał.1_WPF_bazowy!#REF!","v":{"$error":"#REF!"}},{"$f":"+Zał.1_WPF_bazowy!#REF!","v":{"$error":"#REF!"}},{"$f":"+Zał.1_WPF_bazowy!#REF!","v":{"$error":"#REF!"}},{"$f":"+Zał.1_WPF_bazowy!#REF!","v":{"$error":"#REF!"}},{"$f":"+Zał.1_WPF_bazowy!#REF!","v":{"$error":"#REF!"}},{"$f":"+Zał.1_WPF_bazowy!#REF!","v":{"$error":"#REF!"}},{"$f":"+Zał.1_WPF_bazowy!#REF!","v":{"$error":"#REF!"}},{"$f":"+Zał.1_WPF_bazowy!#REF!","v":{"$error":"#REF!"}},{"$f":"+Zał.1_WPF_bazowy!#REF!","v":{"$error":"#REF!"}},{"$f":"+Zał.1_WPF_bazowy!#REF!","v":{"$error":"#REF!"}},{"$f":"+Zał.1_WPF_bazowy!#REF!","v":{"$error":"#REF!"}},{"$f":"+Zał.1_WPF_bazowy!#REF!","v":{"$error":"#REF!"}},{"$f":"+Zał.1_WPF_bazowy!#REF!","v":{"$error":"#REF!"}},{"$f":"+Zał.1_WPF_bazowy!#REF!","v":{"$error":"#REF!"}},{"$f":"+Zał.1_WPF_bazowy!#REF!","v":{"$error":"#REF!"}},{"$f":"+Zał.1_WPF_bazowy!#REF!","v":{"$error":"#REF!"}}]
[null,"12.1.1",null,"-  w tym środki określone w art. 5 ust. 1 pkt 2 ustawy",{"$f":"Zał.1_WPF_bazowy!E69","v":1484838.58},{"$f":"Zał.1_WPF_bazowy!F69","v":2271968.91},{"$f":"Zał.1_WPF_bazowy!G69","v":911911.76},{"$f":"Zał.1_WPF_bazowy!H69","v":911911.76},{"$f":"+Zał.1_WPF_bazowy!I69","v":0},{"$f":"+Zał.1_WPF_bazowy!J69","v":0},{"$f":"+Zał.1_WPF_bazowy!K69","v":0},{"$f":"+Zał.1_WPF_bazowy!L69","v":0},{"$f":"+Zał.1_WPF_bazowy!M69","v":0},{"$f":"+Zał.1_WPF_bazowy!N69","v":0},{"$f":"+Zał.1_WPF_bazowy!O69","v":0},{"$f":"+Zał.1_WPF_bazowy!P69","v":0},{"$f":"+Zał.1_WPF_bazowy!Q69","v":0},{"$f":"+Zał.1_WPF_bazowy!#REF!","v":{"$error":"#REF!"}},{"$f":"+Zał.1_WPF_bazowy!#REF!","v":{"$error":"#REF!"}},{"$f":"+Zał.1_WPF_bazowy!#REF!","v":{"$error":"#REF!"}},{"$f":"+Zał.1_WPF_bazowy!#REF!","v":{"$error":"#REF!"}},{"$f":"+Zał.1_WPF_bazowy!#REF!","v":{"$error":"#REF!"}},{"$f":"+Zał.1_WPF_bazowy!#REF!","v":{"$error":"#REF!"}},{"$f":"+Zał.1_WPF_bazowy!#REF!","v":{"$error":"#REF!"}},{"$f":"+Zał.1_WPF_bazowy!#REF!","v":{"$error":"#REF!"}},{"$f":"+Zał.1_WPF_bazowy!#REF!","v":{"$error":"#REF!"}},{"$f":"+Zał.1_WPF_bazowy!#REF!","v":{"$error":"#REF!"}},{"$f":"+Zał.1_WPF_bazowy!#REF!","v":{"$error":"#REF!"}},{"$f":"+Zał.1_WPF_bazowy!#REF!","v":{"$error":"#REF!"}},{"$f":"+Zał.1_WPF_bazowy!#REF!","v":{"$error":"#REF!"}},{"$f":"+Zał.1_WPF_bazowy!#REF!","v":{"$error":"#REF!"}},{"$f":"+Zał.1_WPF_bazowy!#REF!","v":{"$error":"#REF!"}},{"$f":"+Zał.1_WPF_bazowy!#REF!","v":{"$error":"#REF!"}},{"$f":"+Zał.1_WPF_bazowy!#REF!","v":{"$error":"#REF!"}},{"$f":"+Zał.1_WPF_bazowy!#REF!","v":{"$error":"#REF!"}},{"$f":"+Zał.1_WPF_bazowy!#REF!","v":{"$error":"#REF!"}},{"$f":"+Zał.1_WPF_bazowy!#REF!","v":{"$error":"#REF!"}},{"$f":"+Zał.1_WPF_bazowy!#REF!","v":{"$error":"#REF!"}}]
[null,"12.1.1.1",null,"- w tym środki określone w art. 5 ust. 1 pkt 2 ustawy wynikające wyłącznie z  zawartych umów na realizację programu, projektu lub zadania",{"$f":"Zał.1_WPF_bazowy!E70","v":1484838.58},{"$f":"Zał.1_WPF_bazowy!F70","v":2271968.91},{"$f":"Zał.1_WPF_bazowy!G70","v":911911.76},{"$f":"Zał.1_WPF_bazowy!H70","v":911911.76},{"$f":"+Zał.1_WPF_bazowy!I70","v":0},{"$f":"+Zał.1_WPF_bazowy!J70","v":0},{"$f":"+Zał.1_WPF_bazowy!K70","v":0},{"$f":"+Zał.1_WPF_bazowy!L70","v":0},{"$f":"+Zał.1_WPF_bazowy!M70","v":0},{"$f":"+Zał.1_WPF_bazowy!N70","v":0},{"$f":"+Zał.1_WPF_bazowy!O70","v":0},{"$f":"+Zał.1_WPF_bazowy!P70","v":0},{"$f":"+Zał.1_WPF_bazowy!Q70","v":0},{"$f":"+Zał.1_WPF_bazowy!#REF!","v":{"$error":"#REF!"}},{"$f":"+Zał.1_WPF_bazowy!#REF!","v":{"$error":"#REF!"}},{"$f":"+Zał.1_WPF_bazowy!#REF!","v":{"$error":"#REF!"}},{"$f":"+Zał.1_WPF_bazowy!#REF!","v":{"$error":"#REF!"}},{"$f":"+Zał.1_WPF_bazowy!#REF!","v":{"$error":"#REF!"}},{"$f":"+Zał.1_WPF_bazowy!#REF!","v":{"$error":"#REF!"}},{"$f":"+Zał.1_WPF_bazowy!#REF!","v":{"$error":"#REF!"}},{"$f":"+Zał.1_WPF_bazowy!#REF!","v":{"$error":"#REF!"}},{"$f":"+Zał.1_WPF_bazowy!#REF!","v":{"$error":"#REF!"}},{"$f":"+Zał.1_WPF_bazowy!#REF!","v":{"$error":"#REF!"}},{"$f":"+Zał.1_WPF_bazowy!#REF!","v":{"$error":"#REF!"}},{"$f":"+Zał.1_WPF_bazowy!#REF!","v":{"$error":"#REF!"}},{"$f":"+Zał.1_WPF_bazowy!#REF!","v":{"$error":"#REF!"}},{"$f":"+Zał.1_WPF_bazowy!#REF!","v":{"$error":"#REF!"}},{"$f":"+Zał.1_WPF_bazowy!#REF!","v":{"$error":"#REF!"}},{"$f":"+Zał.1_WPF_bazowy!#REF!","v":{"$error":"#REF!"}},{"$f":"+Zał.1_WPF_bazowy!#REF!","v":{"$error":"#REF!"}},{"$f":"+Zał.1_WPF_bazowy!#REF!","v":{"$error":"#REF!"}},{"$f":"+Zał.1_WPF_bazowy!#REF!","v":{"$error":"#REF!"}},{"$f":"+Zał.1_WPF_bazowy!#REF!","v":{"$error":"#REF!"}},{"$f":"+Zał.1_WPF_bazowy!#REF!","v":{"$error":"#REF!"}}]
[null,"12.2",null,"Dochody majątkowe  na programy, projekty lub zadania finansowane z udziałem środków, o których mowa w art. 5 ust. 1 pkt 2 i 3 ustawy",{"$f":"Zał.1_WPF_bazowy!E71","v":2951853.09},{"$f":"Zał.1_WPF_bazowy!F71","v":2340381.75},{"$f":"Zał.1_WPF_bazowy!G71","v":83947.5},{"$f":"Zał.1_WPF_bazowy!H71","v":83947.5},{"$f":"+Zał.1_WPF_bazowy!I71","v":0},{"$f":"+Zał.1_WPF_bazowy!J71","v":0},{"$f":"+Zał.1_WPF_bazowy!K71","v":0},{"$f":"+Zał.1_WPF_bazowy!L71","v":0},{"$f":"+Zał.1_WPF_bazowy!M71","v":0},{"$f":"+Zał.1_WPF_bazowy!N71","v":0},{"$f":"+Zał.1_WPF_bazowy!O71","v":0},{"$f":"+Zał.1_WPF_bazowy!P71","v":0},{"$f":"+Zał.1_WPF_bazowy!Q71","v":0},{"$f":"+Zał.1_WPF_bazowy!#REF!","v":{"$error":"#REF!"}},{"$f":"+Zał.1_WPF_bazowy!#REF!","v":{"$error":"#REF!"}},{"$f":"+Zał.1_WPF_bazowy!#REF!","v":{"$error":"#REF!"}},{"$f":"+Zał.1_WPF_bazowy!#REF!","v":{"$error":"#REF!"}},{"$f":"+Zał.1_WPF_bazowy!#REF!","v":{"$error":"#REF!"}},{"$f":"+Zał.1_WPF_bazowy!#REF!","v":{"$error":"#REF!"}},{"$f":"+Zał.1_WPF_bazowy!#REF!","v":{"$error":"#REF!"}},{"$f":"+Zał.1_WPF_bazowy!#REF!","v":{"$error":"#REF!"}},{"$f":"+Zał.1_WPF_bazowy!#REF!","v":{"$error":"#REF!"}},{"$f":"+Zał.1_WPF_bazowy!#REF!","v":{"$error":"#REF!"}},{"$f":"+Zał.1_WPF_bazowy!#REF!","v":{"$error":"#REF!"}},{"$f":"+Zał.1_WPF_bazowy!#REF!","v":{"$error":"#REF!"}},{"$f":"+Zał.1_WPF_bazowy!#REF!","v":{"$error":"#REF!"}},{"$f":"+Zał.1_WPF_bazowy!#REF!","v":{"$error":"#REF!"}},{"$f":"+Zał.1_WPF_bazowy!#REF!","v":{"$error":"#REF!"}},{"$f":"+Zał.1_WPF_bazowy!#REF!","v":{"$error":"#REF!"}},{"$f":"+Zał.1_WPF_bazowy!#REF!","v":{"$error":"#REF!"}},{"$f":"+Zał.1_WPF_bazowy!#REF!","v":{"$error":"#REF!"}},{"$f":"+Zał.1_WPF_bazowy!#REF!","v":{"$error":"#REF!"}},{"$f":"+Zał.1_WPF_bazowy!#REF!","v":{"$error":"#REF!"}},{"$f":"+Zał.1_WPF_bazowy!#REF!","v":{"$error":"#REF!"}}]
[null,"12.2.1",null,"-  w tym środki określone w art. 5 ust. 1 pkt 2 ustawy",{"$f":"Zał.1_WPF_bazowy!E72","v":2897484.54},{"$f":"Zał.1_WPF_bazowy!F72","v":2339496.15},{"$f":"Zał.1_WPF_bazowy!G72","v":83947.5},{"$f":"Zał.1_WPF_bazowy!H72","v":83947.5},{"$f":"+Zał.1_WPF_bazowy!I72","v":0},{"$f":"+Zał.1_WPF_bazowy!J72","v":0},{"$f":"+Zał.1_WPF_bazowy!K72","v":0},{"$f":"+Zał.1_WPF_bazowy!L72","v":0},{"$f":"+Zał.1_WPF_bazowy!M72","v":0},{"$f":"+Zał.1_WPF_bazowy!N72","v":0},{"$f":"+Zał.1_WPF_bazowy!O72","v":0},{"$f":"+Zał.1_WPF_bazowy!P72","v":0},{"$f":"+Zał.1_WPF_bazowy!Q72","v":0},{"$f":"+Zał.1_WPF_bazowy!#REF!","v":{"$error":"#REF!"}},{"$f":"+Zał.1_WPF_bazowy!#REF!","v":{"$error":"#REF!"}},{"$f":"+Zał.1_WPF_bazowy!#REF!","v":{"$error":"#REF!"}},{"$f":"+Zał.1_WPF_bazowy!#REF!","v":{"$error":"#REF!"}},{"$f":"+Zał.1_WPF_bazowy!#REF!","v":{"$error":"#REF!"}},{"$f":"+Zał.1_WPF_bazowy!#REF!","v":{"$error":"#REF!"}},{"$f":"+Zał.1_WPF_bazowy!#REF!","v":{"$error":"#REF!"}},{"$f":"+Zał.1_WPF_bazowy!#REF!","v":{"$error":"#REF!"}},{"$f":"+Zał.1_WPF_bazowy!#REF!","v":{"$error":"#REF!"}},{"$f":"+Zał.1_WPF_bazowy!#REF!","v":{"$error":"#REF!"}},{"$f":"+Zał.1_WPF_bazowy!#REF!","v":{"$error":"#REF!"}},{"$f":"+Zał.1_WPF_bazowy!#REF!","v":{"$error":"#REF!"}},{"$f":"+Zał.1_WPF_bazowy!#REF!","v":{"$error":"#REF!"}},{"$f":"+Zał.1_WPF_bazowy!#REF!","v":{"$error":"#REF!"}},{"$f":"+Zał.1_WPF_bazowy!#REF!","v":{"$error":"#REF!"}},{"$f":"+Zał.1_WPF_bazowy!#REF!","v":{"$error":"#REF!"}},{"$f":"+Zał.1_WPF_bazowy!#REF!","v":{"$error":"#REF!"}},{"$f":"+Zał.1_WPF_bazowy!#REF!","v":{"$error":"#REF!"}},{"$f":"+Zał.1_WPF_bazowy!#REF!","v":{"$error":"#REF!"}},{"$f":"+Zał.1_WPF_bazowy!#REF!","v":{"$error":"#REF!"}},{"$f":"+Zał.1_WPF_bazowy!#REF!","v":{"$error":"#REF!"}}]
[null,"12.2.1.1",null,"- w tym środki określone w art. 5 ust. 1 pkt 2 ustawy wynikające wyłącznie z zawartych umów na realizację programu, projektu lub zadania",{"$f":"Zał.1_WPF_bazowy!E73","v":2897484.54},{"$f":"Zał.1_WPF_bazowy!F73","v":2339496.15},{"$f":"Zał.1_WPF_bazowy!G73","v":83947.5},{"$f":"Zał.1_WPF_bazowy!H73","v":83947.5},{"$f":"+Zał.1_WPF_bazowy!I73","v":0},{"$f":"+Zał.1_WPF_bazowy!J73","v":0},{"$f":"+Zał.1_WPF_bazowy!K73","v":0},{"$f":"+Zał.1_WPF_bazowy!L73","v":0},{"$f":"+Zał.1_WPF_bazowy!M73","v":0},{"$f":"+Zał.1_WPF_bazowy!N73","v":0},{"$f":"+Zał.1_WPF_bazowy!O73","v":0},{"$f":"+Zał.1_WPF_bazowy!P73","v":0},{"$f":"+Zał.1_WPF_bazowy!Q73","v":0},{"$f":"+Zał.1_WPF_bazowy!#REF!","v":{"$error":"#REF!"}},{"$f":"+Zał.1_WPF_bazowy!#REF!","v":{"$error":"#REF!"}},{"$f":"+Zał.1_WPF_bazowy!#REF!","v":{"$error":"#REF!"}},{"$f":"+Zał.1_WPF_bazowy!#REF!","v":{"$error":"#REF!"}},{"$f":"+Zał.1_WPF_bazowy!#REF!","v":{"$error":"#REF!"}},{"$f":"+Zał.1_WPF_bazowy!#REF!","v":{"$error":"#REF!"}},{"$f":"+Zał.1_WPF_bazowy!#REF!","v":{"$error":"#REF!"}},{"$f":"+Zał.1_WPF_bazowy!#REF!","v":{"$error":"#REF!"}},{"$f":"+Zał.1_WPF_bazowy!#REF!","v":{"$error":"#REF!"}},{"$f":"+Zał.1_WPF_bazowy!#REF!","v":{"$error":"#REF!"}},{"$f":"+Zał.1_WPF_bazowy!#REF!","v":{"$error":"#REF!"}},{"$f":"+Zał.1_WPF_bazowy!#REF!","v":{"$error":"#REF!"}},{"$f":"+Zał.1_WPF_bazowy!#REF!","v":{"$error":"#REF!"}},{"$f":"+Zał.1_WPF_bazowy!#REF!","v":{"$error":"#REF!"}},{"$f":"+Zał.1_WPF_bazowy!#REF!","v":{"$error":"#REF!"}},{"$f":"+Zał.1_WPF_bazowy!#REF!","v":{"$error":"#REF!"}},{"$f":"+Zał.1_WPF_bazowy!#REF!","v":{"$error":"#REF!"}},{"$f":"+Zał.1_WPF_bazowy!#REF!","v":{"$error":"#REF!"}},{"$f":"+Zał.1_WPF_bazowy!#REF!","v":{"$error":"#REF!"}},{"$f":"+Zał.1_WPF_bazowy!#REF!","v":{"$error":"#REF!"}},{"$f":"+Zał.1_WPF_bazowy!#REF!","v":{"$error":"#REF!"}}]
[null,"12.3",null,"Wydatki bieżące na programy, projekty lub zadania finansowane z udziałem środków, o których mowa w art. 5 ust. 1 pkt 2 i 3 ustawy",{"$f":"Zał.1_WPF_bazowy!E74","v":1714900.4},{"$f":"Zał.1_WPF_bazowy!F74","v":2804189.96},{"$f":"Zał.1_WPF_bazowy!G74","v":988921.26},{"$f":"Zał.1_WPF_bazowy!H74","v":988921.26},{"$f":"+Zał.1_WPF_bazowy!I74","v":0},{"$f":"+Zał.1_WPF_bazowy!J74","v":0},{"$f":"+Zał.1_WPF_bazowy!K74","v":0},{"$f":"+Zał.1_WPF_bazowy!L74","v":0},{"$f":"+Zał.1_WPF_bazowy!M74","v":0},{"$f":"+Zał.1_WPF_bazowy!N74","v":0},{"$f":"+Zał.1_WPF_bazowy!O74","v":0},{"$f":"+Zał.1_WPF_bazowy!P74","v":0},{"$f":"+Zał.1_WPF_bazowy!Q74","v":0},{"$f":"+Zał.1_WPF_bazowy!#REF!","v":{"$error":"#REF!"}},{"$f":"+Zał.1_WPF_bazowy!#REF!","v":{"$error":"#REF!"}},{"$f":"+Zał.1_WPF_bazowy!#REF!","v":{"$error":"#REF!"}},{"$f":"+Zał.1_WPF_bazowy!#REF!","v":{"$error":"#REF!"}},{"$f":"+Zał.1_WPF_bazowy!#REF!","v":{"$error":"#REF!"}},{"$f":"+Zał.1_WPF_bazowy!#REF!","v":{"$error":"#REF!"}},{"$f":"+Zał.1_WPF_bazowy!#REF!","v":{"$error":"#REF!"}},{"$f":"+Zał.1_WPF_bazowy!#REF!","v":{"$error":"#REF!"}},{"$f":"+Zał.1_WPF_bazowy!#REF!","v":{"$error":"#REF!"}},{"$f":"+Zał.1_WPF_bazowy!#REF!","v":{"$error":"#REF!"}},{"$f":"+Zał.1_WPF_bazowy!#REF!","v":{"$error":"#REF!"}},{"$f":"+Zał.1_WPF_bazowy!#REF!","v":{"$error":"#REF!"}},{"$f":"+Zał.1_WPF_bazowy!#REF!","v":{"$error":"#REF!"}},{"$f":"+Zał.1_WPF_bazowy!#REF!","v":{"$error":"#REF!"}},{"$f":"+Zał.1_WPF_bazowy!#REF!","v":{"$error":"#REF!"}},{"$f":"+Zał.1_WPF_bazowy!#REF!","v":{"$error":"#REF!"}},{"$f":"+Zał.1_WPF_bazowy!#REF!","v":{"$error":"#REF!"}},{"$f":"+Zał.1_WPF_bazowy!#REF!","v":{"$error":"#REF!"}},{"$f":"+Zał.1_WPF_bazowy!#REF!","v":{"$error":"#REF!"}},{"$f":"+Zał.1_WPF_bazowy!#REF!","v":{"$error":"#REF!"}},{"$f":"+Zał.1_WPF_bazowy!#REF!","v":{"$error":"#REF!"}}]
[null,"12.3.1",null,"-  w tym finansowane środkami określonymi w art. 5 ust. 1 pkt 2 ustawy ",{"$f":"Zał.1_WPF_bazowy!E75","v":1466388.17},{"$f":"Zał.1_WPF_bazowy!F75","v":2374365.08},{"$f":"Zał.1_WPF_bazowy!G75","v":834890.96},{"$f":"Zał.1_WPF_bazowy!H75","v":834890.96},{"$f":"+Zał.1_WPF_bazowy!I75","v":0},{"$f":"+Zał.1_WPF_bazowy!J75","v":0},{"$f":"+Zał.1_WPF_bazowy!K75","v":0},{"$f":"+Zał.1_WPF_bazowy!L75","v":0},{"$f":"+Zał.1_WPF_bazowy!M75","v":0},{"$f":"+Zał.1_WPF_bazowy!N75","v":0},{"$f":"+Zał.1_WPF_bazowy!O75","v":0},{"$f":"+Zał.1_WPF_bazowy!P75","v":0},{"$f":"+Zał.1_WPF_bazowy!Q75","v":0},{"$f":"+Zał.1_WPF_bazowy!#REF!","v":{"$error":"#REF!"}},{"$f":"+Zał.1_WPF_bazowy!#REF!","v":{"$error":"#REF!"}},{"$f":"+Zał.1_WPF_bazowy!#REF!","v":{"$error":"#REF!"}},{"$f":"+Zał.1_WPF_bazowy!#REF!","v":{"$error":"#REF!"}},{"$f":"+Zał.1_WPF_bazowy!#REF!","v":{"$error":"#REF!"}},{"$f":"+Zał.1_WPF_bazowy!#REF!","v":{"$error":"#REF!"}},{"$f":"+Zał.1_WPF_bazowy!#REF!","v":{"$error":"#REF!"}},{"$f":"+Zał.1_WPF_bazowy!#REF!","v":{"$error":"#REF!"}},{"$f":"+Zał.1_WPF_bazowy!#REF!","v":{"$error":"#REF!"}},{"$f":"+Zał.1_WPF_bazowy!#REF!","v":{"$error":"#REF!"}},{"$f":"+Zał.1_WPF_bazowy!#REF!","v":{"$error":"#REF!"}},{"$f":"+Zał.1_WPF_bazowy!#REF!","v":{"$error":"#REF!"}},{"$f":"+Zał.1_WPF_bazowy!#REF!","v":{"$error":"#REF!"}},{"$f":"+Zał.1_WPF_bazowy!#REF!","v":{"$error":"#REF!"}},{"$f":"+Zał.1_WPF_bazowy!#REF!","v":{"$error":"#REF!"}},{"$f":"+Zał.1_WPF_bazowy!#REF!","v":{"$error":"#REF!"}},{"$f":"+Zał.1_WPF_bazowy!#REF!","v":{"$error":"#REF!"}},{"$f":"+Zał.1_WPF_bazowy!#REF!","v":{"$error":"#REF!"}},{"$f":"+Zał.1_WPF_bazowy!#REF!","v":{"$error":"#REF!"}},{"$f":"+Zał.1_WPF_bazowy!#REF!","v":{"$error":"#REF!"}},{"$f":"+Zał.1_WPF_bazowy!#REF!","v":{"$error":"#REF!"}}]
[null,"12.3.2",null,"Wydatki bieżące na realizację programu, projektu lub zadania wynikające wyłącznie z zawartych umów z podmiotem dysponującym środkami, o których mowa w art. 5 ust. 1 pkt 2 ustawy ",{"$f":"Zał.1_WPF_bazowy!E76","v":1714900.4},{"$f":"Zał.1_WPF_bazowy!F76","v":2804189.96},{"$f":"Zał.1_WPF_bazowy!G76","v":988921.26},{"$f":"Zał.1_WPF_bazowy!H76","v":988921.26},{"$f":"+Zał.1_WPF_bazowy!I76","v":0},{"$f":"+Zał.1_WPF_bazowy!J76","v":0},{"$f":"+Zał.1_WPF_bazowy!K76","v":0},{"$f":"+Zał.1_WPF_bazowy!L76","v":0},{"$f":"+Zał.1_WPF_bazowy!M76","v":0},{"$f":"+Zał.1_WPF_bazowy!N76","v":0},{"$f":"+Zał.1_WPF_bazowy!O76","v":0},{"$f":"+Zał.1_WPF_bazowy!P76","v":0},{"$f":"+Zał.1_WPF_bazowy!Q76","v":0},{"$f":"+Zał.1_WPF_bazowy!#REF!","v":{"$error":"#REF!"}},{"$f":"+Zał.1_WPF_bazowy!#REF!","v":{"$error":"#REF!"}},{"$f":"+Zał.1_WPF_bazowy!#REF!","v":{"$error":"#REF!"}},{"$f":"+Zał.1_WPF_bazowy!#REF!","v":{"$error":"#REF!"}},{"$f":"+Zał.1_WPF_bazowy!#REF!","v":{"$error":"#REF!"}},{"$f":"+Zał.1_WPF_bazowy!#REF!","v":{"$error":"#REF!"}},{"$f":"+Zał.1_WPF_bazowy!#REF!","v":{"$error":"#REF!"}},{"$f":"+Zał.1_WPF_bazowy!#REF!","v":{"$error":"#REF!"}},{"$f":"+Zał.1_WPF_bazowy!#REF!","v":{"$error":"#REF!"}},{"$f":"+Zał.1_WPF_bazowy!#REF!","v":{"$error":"#REF!"}},{"$f":"+Zał.1_WPF_bazowy!#REF!","v":{"$error":"#REF!"}},{"$f":"+Zał.1_WPF_bazowy!#REF!","v":{"$error":"#REF!"}},{"$f":"+Zał.1_WPF_bazowy!#REF!","v":{"$error":"#REF!"}},{"$f":"+Zał.1_WPF_bazowy!#REF!","v":{"$error":"#REF!"}},{"$f":"+Zał.1_WPF_bazowy!#REF!","v":{"$error":"#REF!"}},{"$f":"+Zał.1_WPF_bazowy!#REF!","v":{"$error":"#REF!"}},{"$f":"+Zał.1_WPF_bazowy!#REF!","v":{"$error":"#REF!"}},{"$f":"+Zał.1_WPF_bazowy!#REF!","v":{"$error":"#REF!"}},{"$f":"+Zał.1_WPF_bazowy!#REF!","v":{"$error":"#REF!"}},{"$f":"+Zał.1_WPF_bazowy!#REF!","v":{"$error":"#REF!"}},{"$f":"+Zał.1_WPF_bazowy!#REF!","v":{"$error":"#REF!"}}]
[null,"12.4",null,"Wydatki majątkowe na programy, projekty lub zadania finansowane z udziałem środków, o których mowa w art. 5 ust. 1 pkt 2 i 3 ustawy",{"$f":"Zał.1_WPF_bazowy!E77","v":579470.18999999994},{"$f":"Zał.1_WPF_bazowy!F77","v":191094},{"$f":"Zał.1_WPF_bazowy!G77","v":27150},{"$f":"Zał.1_WPF_bazowy!H77","v":27150},{"$f":"+Zał.1_WPF_bazowy!I77","v":0},{"$f":"+Zał.1_WPF_bazowy!J77","v":0},{"$f":"+Zał.1_WPF_bazowy!K77","v":0},{"$f":"+Zał.1_WPF_bazowy!L77","v":0},{"$f":"+Zał.1_WPF_bazowy!M77","v":0},{"$f":"+Zał.1_WPF_bazowy!N77","v":0},{"$f":"+Zał.1_WPF_bazowy!O77","v":0},{"$f":"+Zał.1_WPF_bazowy!P77","v":0},{"$f":"+Zał.1_WPF_bazowy!Q77","v":0},{"$f":"+Zał.1_WPF_bazowy!#REF!","v":{"$error":"#REF!"}},{"$f":"+Zał.1_WPF_bazowy!#REF!","v":{"$error":"#REF!"}},{"$f":"+Zał.1_WPF_bazowy!#REF!","v":{"$error":"#REF!"}},{"$f":"+Zał.1_WPF_bazowy!#REF!","v":{"$error":"#REF!"}},{"$f":"+Zał.1_WPF_bazowy!#REF!","v":{"$error":"#REF!"}},{"$f":"+Zał.1_WPF_bazowy!#REF!","v":{"$error":"#REF!"}},{"$f":"+Zał.1_WPF_bazowy!#REF!","v":{"$error":"#REF!"}},{"$f":"+Zał.1_WPF_bazowy!#REF!","v":{"$error":"#REF!"}},{"$f":"+Zał.1_WPF_bazowy!#REF!","v":{"$error":"#REF!"}},{"$f":"+Zał.1_WPF_bazowy!#REF!","v":{"$error":"#REF!"}},{"$f":"+Zał.1_WPF_bazowy!#REF!","v":{"$error":"#REF!"}},{"$f":"+Zał.1_WPF_bazowy!#REF!","v":{"$error":"#REF!"}},{"$f":"+Zał.1_WPF_bazowy!#REF!","v":{"$error":"#REF!"}},{"$f":"+Zał.1_WPF_bazowy!#REF!","v":{"$error":"#REF!"}},{"$f":"+Zał.1_WPF_bazowy!#REF!","v":{"$error":"#REF!"}},{"$f":"+Zał.1_WPF_bazowy!#REF!","v":{"$error":"#REF!"}},{"$f":"+Zał.1_WPF_bazowy!#REF!","v":{"$error":"#REF!"}},{"$f":"+Zał.1_WPF_bazowy!#REF!","v":{"$error":"#REF!"}},{"$f":"+Zał.1_WPF_bazowy!#REF!","v":{"$error":"#REF!"}},{"$f":"+Zał.1_WPF_bazowy!#REF!","v":{"$error":"#REF!"}},{"$f":"+Zał.1_WPF_bazowy!#REF!","v":{"$error":"#REF!"}}]
[null,"12.4.1",null,"-  w tym finansowane środkami określonymi w art. 5 ust. 1 pkt 2 ustawy",{"$f":"Zał.1_WPF_bazowy!E78","v":428821.64},{"$f":"Zał.1_WPF_bazowy!F78","v":134139.9},{"$f":"Zał.1_WPF_bazowy!G78","v":27150},{"$f":"Zał.1_WPF_bazowy!H78","v":27150},{"$f":"+Zał.1_WPF_bazowy!I78","v":0},{"$f":"+Zał.1_WPF_bazowy!J78","v":0},{"$f":"+Zał.1_WPF_bazowy!K78","v":0},{"$f":"+Zał.1_WPF_bazowy!L78","v":0},{"$f":"+Zał.1_WPF_bazowy!M78","v":0},{"$f":"+Zał.1_WPF_bazowy!N78","v":0},{"$f":"+Zał.1_WPF_bazowy!O78","v":0},{"$f":"+Zał.1_WPF_bazowy!P78","v":0},{"$f":"+Zał.1_WPF_bazowy!Q78","v":0},{"$f":"+Zał.1_WPF_bazowy!#REF!","v":{"$error":"#REF!"}},{"$f":"+Zał.1_WPF_bazowy!#REF!","v":{"$error":"#REF!"}},{"$f":"+Zał.1_WPF_bazowy!#REF!","v":{"$error":"#REF!"}},{"$f":"+Zał.1_WPF_bazowy!#REF!","v":{"$error":"#REF!"}},{"$f":"+Zał.1_WPF_bazowy!#REF!","v":{"$error":"#REF!"}},{"$f":"+Zał.1_WPF_bazowy!#REF!","v":{"$error":"#REF!"}},{"$f":"+Zał.1_WPF_bazowy!#REF!","v":{"$error":"#REF!"}},{"$f":"+Zał.1_WPF_bazowy!#REF!","v":{"$error":"#REF!"}},{"$f":"+Zał.1_WPF_bazowy!#REF!","v":{"$error":"#REF!"}},{"$f":"+Zał.1_WPF_bazowy!#REF!","v":{"$error":"#REF!"}},{"$f":"+Zał.1_WPF_bazowy!#REF!","v":{"$error":"#REF!"}},{"$f":"+Zał.1_WPF_bazowy!#REF!","v":{"$error":"#REF!"}},{"$f":"+Zał.1_WPF_bazowy!#REF!","v":{"$error":"#REF!"}},{"$f":"+Zał.1_WPF_bazowy!#REF!","v":{"$error":"#REF!"}},{"$f":"+Zał.1_WPF_bazowy!#REF!","v":{"$error":"#REF!"}},{"$f":"+Zał.1_WPF_bazowy!#REF!","v":{"$error":"#REF!"}},{"$f":"+Zał.1_WPF_bazowy!#REF!","v":{"$error":"#REF!"}},{"$f":"+Zał.1_WPF_bazowy!#REF!","v":{"$error":"#REF!"}},{"$f":"+Zał.1_WPF_bazowy!#REF!","v":{"$error":"#REF!"}},{"$f":"+Zał.1_WPF_bazowy!#REF!","v":{"$error":"#REF!"}},{"$f":"+Zał.1_WPF_bazowy!#REF!","v":{"$error":"#REF!"}}]
[null,"12.4.2",null,"Wydatki majątkowe na realizację programu, projektu lub zadania wynikające wyłącznie z zawartych umów z podmiotem dysponującym środkami, o których mowa w art. 5 ust. 1 pkt 2 ustawy ",{"$f":"Zał.1_WPF_bazowy!E79","v":579470.18999999994},{"$f":"Zał.1_WPF_bazowy!F79","v":191094},{"$f":"Zał.1_WPF_bazowy!G79","v":27150},{"$f":"Zał.1_WPF_bazowy!H79","v":27150},{"$f":"+Zał.1_WPF_bazowy!I79","v":0},{"$f":"+Zał.1_WPF_bazowy!J79","v":0},{"$f":"+Zał.1_WPF_bazowy!K79","v":0},{"$f":"+Zał.1_WPF_bazowy!L79","v":0},{"$f":"+Zał.1_WPF_bazowy!M79","v":0},{"$f":"+Zał.1_WPF_bazowy!N79","v":0},{"$f":"+Zał.1_WPF_bazowy!O79","v":0},{"$f":"+Zał.1_WPF_bazowy!P79","v":0},{"$f":"+Zał.1_WPF_bazowy!Q79","v":0},{"$f":"+Zał.1_WPF_bazowy!#REF!","v":{"$error":"#REF!"}},{"$f":"+Zał.1_WPF_bazowy!#REF!","v":{"$error":"#REF!"}},{"$f":"+Zał.1_WPF_bazowy!#REF!","v":{"$error":"#REF!"}},{"$f":"+Zał.1_WPF_bazowy!#REF!","v":{"$error":"#REF!"}},{"$f":"+Zał.1_WPF_bazowy!#REF!","v":{"$error":"#REF!"}},{"$f":"+Zał.1_WPF_bazowy!#REF!","v":{"$error":"#REF!"}},{"$f":"+Zał.1_WPF_bazowy!#REF!","v":{"$error":"#REF!"}},{"$f":"+Zał.1_WPF_bazowy!#REF!","v":{"$error":"#REF!"}},{"$f":"+Zał.1_WPF_bazowy!#REF!","v":{"$error":"#REF!"}},{"$f":"+Zał.1_WPF_bazowy!#REF!","v":{"$error":"#REF!"}},{"$f":"+Zał.1_WPF_bazowy!#REF!","v":{"$error":"#REF!"}},{"$f":"+Zał.1_WPF_bazowy!#REF!","v":{"$error":"#REF!"}},{"$f":"+Zał.1_WPF_bazowy!#REF!","v":{"$error":"#REF!"}},{"$f":"+Zał.1_WPF_bazowy!#REF!","v":{"$error":"#REF!"}},{"$f":"+Zał.1_WPF_bazowy!#REF!","v":{"$error":"#REF!"}},{"$f":"+Zał.1_WPF_bazowy!#REF!","v":{"$error":"#REF!"}},{"$f":"+Zał.1_WPF_bazowy!#REF!","v":{"$error":"#REF!"}},{"$f":"+Zał.1_WPF_bazowy!#REF!","v":{"$error":"#REF!"}},{"$f":"+Zał.1_WPF_bazowy!#REF!","v":{"$error":"#REF!"}},{"$f":"+Zał.1_WPF_bazowy!#REF!","v":{"$error":"#REF!"}},{"$f":"+Zał.1_WPF_bazowy!#REF!","v":{"$error":"#REF!"}}]
[null,"12.5",null,"Wydatki na wkład krajowy w związku z umową na realizację programu, projektu lub zadania finansowanego z udziałem środków, o których mowa w art. 5 ust. 1 pkt 2 ustawy bez względu na stopień finansowania tymi środkami ",{"$f":"Zał.1_WPF_bazowy!E80","v":0},{"$f":"Zał.1_WPF_bazowy!F80","v":0},{"$f":"Zał.1_WPF_bazowy!G80","v":0},{"$f":"Zał.1_WPF_bazowy!H80","v":0},{"$f":"+Zał.1_WPF_bazowy!I80","v":0},{"$f":"+Zał.1_WPF_bazowy!J80","v":0},{"$f":"+Zał.1_WPF_bazowy!K80","v":0},{"$f":"+Zał.1_WPF_bazowy!L80","v":0},{"$f":"+Zał.1_WPF_bazowy!M80","v":0},{"$f":"+Zał.1_WPF_bazowy!N80","v":0},{"$f":"+Zał.1_WPF_bazowy!O80","v":0},{"$f":"+Zał.1_WPF_bazowy!P80","v":0},{"$f":"+Zał.1_WPF_bazowy!Q80","v":0},{"$f":"+Zał.1_WPF_bazowy!#REF!","v":{"$error":"#REF!"}},{"$f":"+Zał.1_WPF_bazowy!#REF!","v":{"$error":"#REF!"}},{"$f":"+Zał.1_WPF_bazowy!#REF!","v":{"$error":"#REF!"}},{"$f":"+Zał.1_WPF_bazowy!#REF!","v":{"$error":"#REF!"}},{"$f":"+Zał.1_WPF_bazowy!#REF!","v":{"$error":"#REF!"}},{"$f":"+Zał.1_WPF_bazowy!#REF!","v":{"$error":"#REF!"}},{"$f":"+Zał.1_WPF_bazowy!#REF!","v":{"$error":"#REF!"}},{"$f":"+Zał.1_WPF_bazowy!#REF!","v":{"$error":"#REF!"}},{"$f":"+Zał.1_WPF_bazowy!#REF!","v":{"$error":"#REF!"}},{"$f":"+Zał.1_WPF_bazowy!#REF!","v":{"$error":"#REF!"}},{"$f":"+Zał.1_WPF_bazowy!#REF!","v":{"$error":"#REF!"}},{"$f":"+Zał.1_WPF_bazowy!#REF!","v":{"$error":"#REF!"}},{"$f":"+Zał.1_WPF_bazowy!#REF!","v":{"$error":"#REF!"}},{"$f":"+Zał.1_WPF_bazowy!#REF!","v":{"$error":"#REF!"}},{"$f":"+Zał.1_WPF_bazowy!#REF!","v":{"$error":"#REF!"}},{"$f":"+Zał.1_WPF_bazowy!#REF!","v":{"$error":"#REF!"}},{"$f":"+Zał.1_WPF_bazowy!#REF!","v":{"$error":"#REF!"}},{"$f":"+Zał.1_WPF_bazowy!#REF!","v":{"$error":"#REF!"}},{"$f":"+Zał.1_WPF_bazowy!#REF!","v":{"$error":"#REF!"}},{"$f":"+Zał.1_WPF_bazowy!#REF!","v":{"$error":"#REF!"}},{"$f":"+Zał.1_WPF_bazowy!#REF!","v":{"$error":"#REF!"}}]
[null,"12.5.1",null,"w tym w związku z już zawartą umową na realizację programu, projektu lub zadania",{"$f":"Zał.1_WPF_bazowy!E81","v":0},{"$f":"Zał.1_WPF_bazowy!F81","v":0},{"$f":"Zał.1_WPF_bazowy!G81","v":0},{"$f":"Zał.1_WPF_bazowy!H81","v":0},{"$f":"+Zał.1_WPF_bazowy!I81","v":0},{"$f":"+Zał.1_WPF_bazowy!J81","v":0},{"$f":"+Zał.1_WPF_bazowy!K81","v":0},{"$f":"+Zał.1_WPF_bazowy!L81","v":0},{"$f":"+Zał.1_WPF_bazowy!M81","v":0},{"$f":"+Zał.1_WPF_bazowy!N81","v":0},{"$f":"+Zał.1_WPF_bazowy!O81","v":0},{"$f":"+Zał.1_WPF_bazowy!P81","v":0},{"$f":"+Zał.1_WPF_bazowy!Q81","v":0},{"$f":"+Zał.1_WPF_bazowy!#REF!","v":{"$error":"#REF!"}},{"$f":"+Zał.1_WPF_bazowy!#REF!","v":{"$error":"#REF!"}},{"$f":"+Zał.1_WPF_bazowy!#REF!","v":{"$error":"#REF!"}},{"$f":"+Zał.1_WPF_bazowy!#REF!","v":{"$error":"#REF!"}},{"$f":"+Zał.1_WPF_bazowy!#REF!","v":{"$error":"#REF!"}},{"$f":"+Zał.1_WPF_bazowy!#REF!","v":{"$error":"#REF!"}},{"$f":"+Zał.1_WPF_bazowy!#REF!","v":{"$error":"#REF!"}},{"$f":"+Zał.1_WPF_bazowy!#REF!","v":{"$error":"#REF!"}},{"$f":"+Zał.1_WPF_bazowy!#REF!","v":{"$error":"#REF!"}},{"$f":"+Zał.1_WPF_bazowy!#REF!","v":{"$error":"#REF!"}},{"$f":"+Zał.1_WPF_bazowy!#REF!","v":{"$error":"#REF!"}},{"$f":"+Zał.1_WPF_bazowy!#REF!","v":{"$error":"#REF!"}},{"$f":"+Zał.1_WPF_bazowy!#REF!","v":{"$error":"#REF!"}},{"$f":"+Zał.1_WPF_bazowy!#REF!","v":{"$error":"#REF!"}},{"$f":"+Zał.1_WPF_bazowy!#REF!","v":{"$error":"#REF!"}},{"$f":"+Zał.1_WPF_bazowy!#REF!","v":{"$error":"#REF!"}},{"$f":"+Zał.1_WPF_bazowy!#REF!","v":{"$error":"#REF!"}},{"$f":"+Zał.1_WPF_bazowy!#REF!","v":{"$error":"#REF!"}},{"$f":"+Zał.1_WPF_bazowy!#REF!","v":{"$error":"#REF!"}},{"$f":"+Zał.1_WPF_bazowy!#REF!","v":{"$error":"#REF!"}},{"$f":"+Zał.1_WPF_bazowy!#REF!","v":{"$error":"#REF!"}}]
[null,"12.6",null,"Wydatki na wkład krajowy w związku z zawartą po dniu 1 stycznia 2013 r. umową na realizację programu, projektu lub zadania finansowanego w co najmniej 60% środkami, o których mowa w art. 5 ust. 1 pkt 2 ustawy",{"$f":"Zał.1_WPF_bazowy!E82","v":0},{"$f":"Zał.1_WPF_bazowy!F82","v":0},{"$f":"Zał.1_WPF_bazowy!G82","v":0},{"$f":"Zał.1_WPF_bazowy!H82","v":0},{"$f":"+Zał.1_WPF_bazowy!I82","v":0},{"$f":"+Zał.1_WPF_bazowy!J82","v":0},{"$f":"+Zał.1_WPF_bazowy!K82","v":0},{"$f":"+Zał.1_WPF_bazowy!L82","v":0},{"$f":"+Zał.1_WPF_bazowy!M82","v":0},{"$f":"+Zał.1_WPF_bazowy!N82","v":0},{"$f":"+Zał.1_WPF_bazowy!O82","v":0},{"$f":"+Zał.1_WPF_bazowy!P82","v":0},{"$f":"+Zał.1_WPF_bazowy!Q82","v":0},{"$f":"+Zał.1_WPF_bazowy!#REF!","v":{"$error":"#REF!"}},{"$f":"+Zał.1_WPF_bazowy!#REF!","v":{"$error":"#REF!"}},{"$f":"+Zał.1_WPF_bazowy!#REF!","v":{"$error":"#REF!"}},{"$f":"+Zał.1_WPF_bazowy!#REF!","v":{"$error":"#REF!"}},{"$f":"+Zał.1_WPF_bazowy!#REF!","v":{"$error":"#REF!"}},{"$f":"+Zał.1_WPF_bazowy!#REF!","v":{"$error":"#REF!"}},{"$f":"+Zał.1_WPF_bazowy!#REF!","v":{"$error":"#REF!"}},{"$f":"+Zał.1_WPF_bazowy!#REF!","v":{"$error":"#REF!"}},{"$f":"+Zał.1_WPF_bazowy!#REF!","v":{"$error":"#REF!"}},{"$f":"+Zał.1_WPF_bazowy!#REF!","v":{"$error":"#REF!"}},{"$f":"+Zał.1_WPF_bazowy!#REF!","v":{"$error":"#REF!"}},{"$f":"+Zał.1_WPF_bazowy!#REF!","v":{"$error":"#REF!"}},{"$f":"+Zał.1_WPF_bazowy!#REF!","v":{"$error":"#REF!"}},{"$f":"+Zał.1_WPF_bazowy!#REF!","v":{"$error":"#REF!"}},{"$f":"+Zał.1_WPF_bazowy!#REF!","v":{"$error":"#REF!"}},{"$f":"+Zał.1_WPF_bazowy!#REF!","v":{"$error":"#REF!"}},{"$f":"+Zał.1_WPF_bazowy!#REF!","v":{"$error":"#REF!"}},{"$f":"+Zał.1_WPF_bazowy!#REF!","v":{"$error":"#REF!"}},{"$f":"+Zał.1_WPF_bazowy!#REF!","v":{"$error":"#REF!"}},{"$f":"+Zał.1_WPF_bazowy!#REF!","v":{"$error":"#REF!"}},{"$f":"+Zał.1_WPF_bazowy!#REF!","v":{"$error":"#REF!"}}]
[null,"12.6.1",null,"w tym w związku z już zawartą umową na realizację programu, projektu lub zadania",{"$f":"Zał.1_WPF_bazowy!E83","v":0},{"$f":"Zał.1_WPF_bazowy!F83","v":0},{"$f":"Zał.1_WPF_bazowy!G83","v":0},{"$f":"Zał.1_WPF_bazowy!H83","v":0},{"$f":"+Zał.1_WPF_bazowy!I83","v":0},{"$f":"+Zał.1_WPF_bazowy!J83","v":0},{"$f":"+Zał.1_WPF_bazowy!K83","v":0},{"$f":"+Zał.1_WPF_bazowy!L83","v":0},{"$f":"+Zał.1_WPF_bazowy!M83","v":0},{"$f":"+Zał.1_WPF_bazowy!N83","v":0},{"$f":"+Zał.1_WPF_bazowy!O83","v":0},{"$f":"+Zał.1_WPF_bazowy!P83","v":0},{"$f":"+Zał.1_WPF_bazowy!Q83","v":0},{"$f":"+Zał.1_WPF_bazowy!#REF!","v":{"$error":"#REF!"}},{"$f":"+Zał.1_WPF_bazowy!#REF!","v":{"$error":"#REF!"}},{"$f":"+Zał.1_WPF_bazowy!#REF!","v":{"$error":"#REF!"}},{"$f":"+Zał.1_WPF_bazowy!#REF!","v":{"$error":"#REF!"}},{"$f":"+Zał.1_WPF_bazowy!#REF!","v":{"$error":"#REF!"}},{"$f":"+Zał.1_WPF_bazowy!#REF!","v":{"$error":"#REF!"}},{"$f":"+Zał.1_WPF_bazowy!#REF!","v":{"$error":"#REF!"}},{"$f":"+Zał.1_WPF_bazowy!#REF!","v":{"$error":"#REF!"}},{"$f":"+Zał.1_WPF_bazowy!#REF!","v":{"$error":"#REF!"}},{"$f":"+Zał.1_WPF_bazowy!#REF!","v":{"$error":"#REF!"}},{"$f":"+Zał.1_WPF_bazowy!#REF!","v":{"$error":"#REF!"}},{"$f":"+Zał.1_WPF_bazowy!#REF!","v":{"$error":"#REF!"}},{"$f":"+Zał.1_WPF_bazowy!#REF!","v":{"$error":"#REF!"}},{"$f":"+Zał.1_WPF_bazowy!#REF!","v":{"$error":"#REF!"}},{"$f":"+Zał.1_WPF_bazowy!#REF!","v":{"$error":"#REF!"}},{"$f":"+Zał.1_WPF_bazowy!#REF!","v":{"$error":"#REF!"}},{"$f":"+Zał.1_WPF_bazowy!#REF!","v":{"$error":"#REF!"}},{"$f":"+Zał.1_WPF_bazowy!#REF!","v":{"$error":"#REF!"}},{"$f":"+Zał.1_WPF_bazowy!#REF!","v":{"$error":"#REF!"}},{"$f":"+Zał.1_WPF_bazowy!#REF!","v":{"$error":"#REF!"}},{"$f":"+Zał.1_WPF_bazowy!#REF!","v":{"$error":"#REF!"}}]
[null,"12.7",null,"Przychody z tytułu kredytów, pożyczek, emisji papierów wartościowych powstające w związku z umową na realizację programu, projektu lub zadania finansowanego z udziałem środków, o których mowa w art. 5 ust. 1 pkt 2 ustawy bez względu na stopień finansowania tymi środkami ",{"$f":"Zał.1_WPF_bazowy!E84","v":0},{"$f":"Zał.1_WPF_bazowy!F84","v":0},{"$f":"Zał.1_WPF_bazowy!G84","v":0},{"$f":"Zał.1_WPF_bazowy!H84","v":0},{"$f":"+Zał.1_WPF_bazowy!I84","v":0},{"$f":"+Zał.1_WPF_bazowy!J84","v":0},{"$f":"+Zał.1_WPF_bazowy!K84","v":0},{"$f":"+Zał.1_WPF_bazowy!L84","v":0},{"$f":"+Zał.1_WPF_bazowy!M84","v":0},{"$f":"+Zał.1_WPF_bazowy!N84","v":0},{"$f":"+Zał.1_WPF_bazowy!O84","v":0},{"$f":"+Zał.1_WPF_bazowy!P84","v":0},{"$f":"+Zał.1_WPF_bazowy!Q84","v":0},{"$f":"+Zał.1_WPF_bazowy!#REF!","v":{"$error":"#REF!"}},{"$f":"+Zał.1_WPF_bazowy!#REF!","v":{"$error":"#REF!"}},{"$f":"+Zał.1_WPF_bazowy!#REF!","v":{"$error":"#REF!"}},{"$f":"+Zał.1_WPF_bazowy!#REF!","v":{"$error":"#REF!"}},{"$f":"+Zał.1_WPF_bazowy!#REF!","v":{"$error":"#REF!"}},{"$f":"+Zał.1_WPF_bazowy!#REF!","v":{"$error":"#REF!"}},{"$f":"+Zał.1_WPF_bazowy!#REF!","v":{"$error":"#REF!"}},{"$f":"+Zał.1_WPF_bazowy!#REF!","v":{"$error":"#REF!"}},{"$f":"+Zał.1_WPF_bazowy!#REF!","v":{"$error":"#REF!"}},{"$f":"+Zał.1_WPF_bazowy!#REF!","v":{"$error":"#REF!"}},{"$f":"+Zał.1_WPF_bazowy!#REF!","v":{"$error":"#REF!"}},{"$f":"+Zał.1_WPF_bazowy!#REF!","v":{"$error":"#REF!"}},{"$f":"+Zał.1_WPF_bazowy!#REF!","v":{"$error":"#REF!"}},{"$f":"+Zał.1_WPF_bazowy!#REF!","v":{"$error":"#REF!"}},{"$f":"+Zał.1_WPF_bazowy!#REF!","v":{"$error":"#REF!"}},{"$f":"+Zał.1_WPF_bazowy!#REF!","v":{"$error":"#REF!"}},{"$f":"+Zał.1_WPF_bazowy!#REF!","v":{"$error":"#REF!"}},{"$f":"+Zał.1_WPF_bazowy!#REF!","v":{"$error":"#REF!"}},{"$f":"+Zał.1_WPF_bazowy!#REF!","v":{"$error":"#REF!"}},{"$f":"+Zał.1_WPF_bazowy!#REF!","v":{"$error":"#REF!"}},{"$f":"+Zał.1_WPF_bazowy!#REF!","v":{"$error":"#REF!"}}]
[null,"12.7.1",null,"w tym w związku z już zawartą umową na realizację programu, projektu lub zadania",{"$f":"Zał.1_WPF_bazowy!E85","v":0},{"$f":"Zał.1_WPF_bazowy!F85","v":0},{"$f":"Zał.1_WPF_bazowy!G85","v":0},{"$f":"Zał.1_WPF_bazowy!H85","v":0},{"$f":"+Zał.1_WPF_bazowy!I85","v":0},{"$f":"+Zał.1_WPF_bazowy!J85","v":0},{"$f":"+Zał.1_WPF_bazowy!K85","v":0},{"$f":"+Zał.1_WPF_bazowy!L85","v":0},{"$f":"+Zał.1_WPF_bazowy!M85","v":0},{"$f":"+Zał.1_WPF_bazowy!N85","v":0},{"$f":"+Zał.1_WPF_bazowy!O85","v":0},{"$f":"+Zał.1_WPF_bazowy!P85","v":0},{"$f":"+Zał.1_WPF_bazowy!Q85","v":0},{"$f":"+Zał.1_WPF_bazowy!#REF!","v":{"$error":"#REF!"}},{"$f":"+Zał.1_WPF_bazowy!#REF!","v":{"$error":"#REF!"}},{"$f":"+Zał.1_WPF_bazowy!#REF!","v":{"$error":"#REF!"}},{"$f":"+Zał.1_WPF_bazowy!#REF!","v":{"$error":"#REF!"}},{"$f":"+Zał.1_WPF_bazowy!#REF!","v":{"$error":"#REF!"}},{"$f":"+Zał.1_WPF_bazowy!#REF!","v":{"$error":"#REF!"}},{"$f":"+Zał.1_WPF_bazowy!#REF!","v":{"$error":"#REF!"}},{"$f":"+Zał.1_WPF_bazowy!#REF!","v":{"$error":"#REF!"}},{"$f":"+Zał.1_WPF_bazowy!#REF!","v":{"$error":"#REF!"}},{"$f":"+Zał.1_WPF_bazowy!#REF!","v":{"$error":"#REF!"}},{"$f":"+Zał.1_WPF_bazowy!#REF!","v":{"$error":"#REF!"}},{"$f":"+Zał.1_WPF_bazowy!#REF!","v":{"$error":"#REF!"}},{"$f":"+Zał.1_WPF_bazowy!#REF!","v":{"$error":"#REF!"}},{"$f":"+Zał.1_WPF_bazowy!#REF!","v":{"$error":"#REF!"}},{"$f":"+Zał.1_WPF_bazowy!#REF!","v":{"$error":"#REF!"}},{"$f":"+Zał.1_WPF_bazowy!#REF!","v":{"$error":"#REF!"}},{"$f":"+Zał.1_WPF_bazowy!#REF!","v":{"$error":"#REF!"}},{"$f":"+Zał.1_WPF_bazowy!#REF!","v":{"$error":"#REF!"}},{"$f":"+Zał.1_WPF_bazowy!#REF!","v":{"$error":"#REF!"}},{"$f":"+Zał.1_WPF_bazowy!#REF!","v":{"$error":"#REF!"}},{"$f":"+Zał.1_WPF_bazowy!#REF!","v":{"$error":"#REF!"}}]
[null,"12.8",null,"Przychody z tytułu kredytów, pożyczek, emisji papierów wartościowych powstające w związku z zawartą po dniu 1 stycznia 2013 r. umową na realizację programu, projektu lub zadania finansowanego w co najmniej 60% środkami, o których mowa w art. 5 ust. 1 pkt 2 ustawy",{"$f":"Zał.1_WPF_bazowy!E86","v":0},{"$f":"Zał.1_WPF_bazowy!F86","v":0},{"$f":"Zał.1_WPF_bazowy!G86","v":0},{"$f":"Zał.1_WPF_bazowy!H86","v":0},{"$f":"+Zał.1_WPF_bazowy!I86","v":0},{"$f":"+Zał.1_WPF_bazowy!J86","v":0},{"$f":"+Zał.1_WPF_bazowy!K86","v":0},{"$f":"+Zał.1_WPF_bazowy!L86","v":0},{"$f":"+Zał.1_WPF_bazowy!M86","v":0},{"$f":"+Zał.1_WPF_bazowy!N86","v":0},{"$f":"+Zał.1_WPF_bazowy!O86","v":0},{"$f":"+Zał.1_WPF_bazowy!P86","v":0},{"$f":"+Zał.1_WPF_bazowy!Q86","v":0},{"$f":"+Zał.1_WPF_bazowy!#REF!","v":{"$error":"#REF!"}},{"$f":"+Zał.1_WPF_bazowy!#REF!","v":{"$error":"#REF!"}},{"$f":"+Zał.1_WPF_bazowy!#REF!","v":{"$error":"#REF!"}},{"$f":"+Zał.1_WPF_bazowy!#REF!","v":{"$error":"#REF!"}},{"$f":"+Zał.1_WPF_bazowy!#REF!","v":{"$error":"#REF!"}},{"$f":"+Zał.1_WPF_bazowy!#REF!","v":{"$error":"#REF!"}},{"$f":"+Zał.1_WPF_bazowy!#REF!","v":{"$error":"#REF!"}},{"$f":"+Zał.1_WPF_bazowy!#REF!","v":{"$error":"#REF!"}},{"$f":"+Zał.1_WPF_bazowy!#REF!","v":{"$error":"#REF!"}},{"$f":"+Zał.1_WPF_bazowy!#REF!","v":{"$error":"#REF!"}},{"$f":"+Zał.1_WPF_bazowy!#REF!","v":{"$error":"#REF!"}},{"$f":"+Zał.1_WPF_bazowy!#REF!","v":{"$error":"#REF!"}},{"$f":"+Zał.1_WPF_bazowy!#REF!","v":{"$error":"#REF!"}},{"$f":"+Zał.1_WPF_bazowy!#REF!","v":{"$error":"#REF!"}},{"$f":"+Zał.1_WPF_bazowy!#REF!","v":{"$error":"#REF!"}},{"$f":"+Zał.1_WPF_bazowy!#REF!","v":{"$error":"#REF!"}},{"$f":"+Zał.1_WPF_bazowy!#REF!","v":{"$error":"#REF!"}},{"$f":"+Zał.1_WPF_bazowy!#REF!","v":{"$error":"#REF!"}},{"$f":"+Zał.1_WPF_bazowy!#REF!","v":{"$error":"#REF!"}},{"$f":"+Zał.1_WPF_bazowy!#REF!","v":{"$error":"#REF!"}},{"$f":"+Zał.1_WPF_bazowy!#REF!","v":{"$error":"#REF!"}}]
[null,"12.8.1",null,"w tym w związku z już zawartą umową na realizację programu, projektu lub zadania",{"$f":"Zał.1_WPF_bazowy!E87","v":0},{"$f":"Zał.1_WPF_bazowy!F87","v":0},{"$f":"Zał.1_WPF_bazowy!G87","v":0},{"$f":"Zał.1_WPF_bazowy!H87","v":0},{"$f":"+Zał.1_WPF_bazowy!I87","v":0},{"$f":"+Zał.1_WPF_bazowy!J87","v":0},{"$f":"+Zał.1_WPF_bazowy!K87","v":0},{"$f":"+Zał.1_WPF_bazowy!L87","v":0},{"$f":"+Zał.1_WPF_bazowy!M87","v":0},{"$f":"+Zał.1_WPF_bazowy!N87","v":0},{"$f":"+Zał.1_WPF_bazowy!O87","v":0},{"$f":"+Zał.1_WPF_bazowy!P87","v":0},{"$f":"+Zał.1_WPF_bazowy!Q87","v":0},{"$f":"+Zał.1_WPF_bazowy!#REF!","v":{"$error":"#REF!"}},{"$f":"+Zał.1_WPF_bazowy!#REF!","v":{"$error":"#REF!"}},{"$f":"+Zał.1_WPF_bazowy!#REF!","v":{"$error":"#REF!"}},{"$f":"+Zał.1_WPF_bazowy!#REF!","v":{"$error":"#REF!"}},{"$f":"+Zał.1_WPF_bazowy!#REF!","v":{"$error":"#REF!"}},{"$f":"+Zał.1_WPF_bazowy!#REF!","v":{"$error":"#REF!"}},{"$f":"+Zał.1_WPF_bazowy!#REF!","v":{"$error":"#REF!"}},{"$f":"+Zał.1_WPF_bazowy!#REF!","v":{"$error":"#REF!"}},{"$f":"+Zał.1_WPF_bazowy!#REF!","v":{"$error":"#REF!"}},{"$f":"+Zał.1_WPF_bazowy!#REF!","v":{"$error":"#REF!"}},{"$f":"+Zał.1_WPF_bazowy!#REF!","v":{"$error":"#REF!"}},{"$f":"+Zał.1_WPF_bazowy!#REF!","v":{"$error":"#REF!"}},{"$f":"+Zał.1_WPF_bazowy!#REF!","v":{"$error":"#REF!"}},{"$f":"+Zał.1_WPF_bazowy!#REF!","v":{"$error":"#REF!"}},{"$f":"+Zał.1_WPF_bazowy!#REF!","v":{"$error":"#REF!"}},{"$f":"+Zał.1_WPF_bazowy!#REF!","v":{"$error":"#REF!"}},{"$f":"+Zał.1_WPF_bazowy!#REF!","v":{"$error":"#REF!"}},{"$f":"+Zał.1_WPF_bazowy!#REF!","v":{"$error":"#REF!"}},{"$f":"+Zał.1_WPF_bazowy!#REF!","v":{"$error":"#REF!"}},{"$f":"+Zał.1_WPF_bazowy!#REF!","v":{"$error":"#REF!"}},{"$f":"+Zał.1_WPF_bazowy!#REF!","v":{"$error":"#REF!"}}]
[null,13,null,"Kwoty dotyczące przejęcia i spłaty zobowiązań po samodzielnych publicznych zakładach opieki zdrowotnej oraz pokrycia ujemnego wyniku ","x","x","x","x","x","x","x","x","x","x","x","x","x","x","x","x","x","x","x","x","x","x","x","x","x","x","x","x","x","x","x","x","x","x"]
[null,"13.1",null,"Kwota zobowiązań wynikających z przejęcia przez jednostkę samorządu terytorialnego zobowiązań po likwidowanych i przekształcanych samodzielnych zakładach opieki zdrowotnej",{"$f":"Zał.1_WPF_bazowy!E89","v":0},{"$f":"Zał.1_WPF_bazowy!F89","v":0},{"$f":"Zał.1_WPF_bazowy!G89","v":0},{"$f":"Zał.1_WPF_bazowy!H89","v":0},{"$f":"+IF(I10<>0,H96-(I98+I99+I100+I101),0)","v":0},0,0,0,0,0,0,0,0,{"$error":"#REF!"},{"$error":"#REF!"},{"$error":"#REF!"},{"$error":"#REF!"},{"$error":"#REF!"},{"$error":"#REF!"},{"$error":"#REF!"},{"$error":"#REF!"},{"$error":"#REF!"},{"$error":"#REF!"},{"$error":"#REF!"},{"$error":"#REF!"},{"$error":"#REF!"},{"$error":"#REF!"},{"$error":"#REF!"},{"$error":"#REF!"},{"$error":"#REF!"},{"$error":"#REF!"},{"$error":"#REF!"},{"$error":"#REF!"},{"$error":"#REF!"}]
[null,"13.2",null,"Dochody budżetowe z tytułu dotacji celowej z budżetu państwa, o której mowa w art. 196 ustawy z  dnia 15 kwietnia 2011 r.  o działalności leczniczej (Dz.U. Nr 112, poz. 654, z późn. zm.)",{"$f":"Zał.1_WPF_bazowy!E90","v":0},{"$f":"Zał.1_WPF_bazowy!F90","v":0},{"$f":"Zał.1_WPF_bazowy!G90","v":0},{"$f":"Zał.1_WPF_bazowy!H90","v":0},{"$f":"+Zał.1_WPF_bazowy!I90","v":0},{"$f":"+Zał.1_WPF_bazowy!J90","v":0},{"$f":"+Zał.1_WPF_bazowy!K90","v":0},{"$f":"+Zał.1_WPF_bazowy!L90","v":0},{"$f":"+Zał.1_WPF_bazowy!M90","v":0},{"$f":"+Zał.1_WPF_bazowy!N90","v":0},{"$f":"+Zał.1_WPF_bazowy!O90","v":0},{"$f":"+Zał.1_WPF_bazowy!P90","v":0},{"$f":"+Zał.1_WPF_bazowy!Q90","v":0},{"$f":"+Zał.1_WPF_bazowy!#REF!","v":{"$error":"#REF!"}},{"$f":"+Zał.1_WPF_bazowy!#REF!","v":{"$error":"#REF!"}},{"$f":"+Zał.1_WPF_bazowy!#REF!","v":{"$error":"#REF!"}},{"$f":"+Zał.1_WPF_bazowy!#REF!","v":{"$error":"#REF!"}},{"$f":"+Zał.1_WPF_bazowy!#REF!","v":{"$error":"#REF!"}},{"$f":"+Zał.1_WPF_bazowy!#REF!","v":{"$error":"#REF!"}},{"$f":"+Zał.1_WPF_bazowy!#REF!","v":{"$error":"#REF!"}},{"$f":"+Zał.1_WPF_bazowy!#REF!","v":{"$error":"#REF!"}},{"$f":"+Zał.1_WPF_bazowy!#REF!","v":{"$error":"#REF!"}},{"$f":"+Zał.1_WPF_bazowy!#REF!","v":{"$error":"#REF!"}},{"$f":"+Zał.1_WPF_bazowy!#REF!","v":{"$error":"#REF!"}},{"$f":"+Zał.1_WPF_bazowy!#REF!","v":{"$error":"#REF!"}},{"$f":"+Zał.1_WPF_bazowy!#REF!","v":{"$error":"#REF!"}},{"$f":"+Zał.1_WPF_bazowy!#REF!","v":{"$error":"#REF!"}},{"$f":"+Zał.1_WPF_bazowy!#REF!","v":{"$error":"#REF!"}},{"$f":"+Zał.1_WPF_bazowy!#REF!","v":{"$error":"#REF!"}},{"$f":"+Zał.1_WPF_bazowy!#REF!","v":{"$error":"#REF!"}},{"$f":"+Zał.1_WPF_bazowy!#REF!","v":{"$error":"#REF!"}},{"$f":"+Zał.1_WPF_bazowy!#REF!","v":{"$error":"#REF!"}},{"$f":"+Zał.1_WPF_bazowy!#REF!","v":{"$error":"#REF!"}},{"$f":"+Zał.1_WPF_bazowy!#REF!","v":{"$error":"#REF!"}}]
[null,"13.3",null,"Wysokość zobowiązań podlegających umorzeniu, o którym mowa w art. 190 ustawy o działalności leczniczej",{"$f":"Zał.1_WPF_bazowy!E91","v":0},{"$f":"Zał.1_WPF_bazowy!F91","v":0},{"$f":"Zał.1_WPF_bazowy!G91","v":0},{"$f":"Zał.1_WPF_bazowy!H91","v":0},{"$f":"+Zał.1_WPF_bazowy!I91","v":0},{"$f":"+Zał.1_WPF_bazowy!J91","v":0},{"$f":"+Zał.1_WPF_bazowy!K91","v":0},{"$f":"+Zał.1_WPF_bazowy!L91","v":0},{"$f":"+Zał.1_WPF_bazowy!M91","v":0},{"$f":"+Zał.1_WPF_bazowy!N91","v":0},{"$f":"+Zał.1_WPF_bazowy!O91","v":0},{"$f":"+Zał.1_WPF_bazowy!P91","v":0},{"$f":"+Zał.1_WPF_bazowy!Q91","v":0},{"$f":"+Zał.1_WPF_bazowy!#REF!","v":{"$error":"#REF!"}},{"$f":"+Zał.1_WPF_bazowy!#REF!","v":{"$error":"#REF!"}},{"$f":"+Zał.1_WPF_bazowy!#REF!","v":{"$error":"#REF!"}},{"$f":"+Zał.1_WPF_bazowy!#REF!","v":{"$error":"#REF!"}},{"$f":"+Zał.1_WPF_bazowy!#REF!","v":{"$error":"#REF!"}},{"$f":"+Zał.1_WPF_bazowy!#REF!","v":{"$error":"#REF!"}},{"$f":"+Zał.1_WPF_bazowy!#REF!","v":{"$error":"#REF!"}},{"$f":"+Zał.1_WPF_bazowy!#REF!","v":{"$error":"#REF!"}},{"$f":"+Zał.1_WPF_bazowy!#REF!","v":{"$error":"#REF!"}},{"$f":"+Zał.1_WPF_bazowy!#REF!","v":{"$error":"#REF!"}},{"$f":"+Zał.1_WPF_bazowy!#REF!","v":{"$error":"#REF!"}},{"$f":"+Zał.1_WPF_bazowy!#REF!","v":{"$error":"#REF!"}},{"$f":"+Zał.1_WPF_bazowy!#REF!","v":{"$error":"#REF!"}},{"$f":"+Zał.1_WPF_bazowy!#REF!","v":{"$error":"#REF!"}},{"$f":"+Zał.1_WPF_bazowy!#REF!","v":{"$error":"#REF!"}},{"$f":"+Zał.1_WPF_bazowy!#REF!","v":{"$error":"#REF!"}},{"$f":"+Zał.1_WPF_bazowy!#REF!","v":{"$error":"#REF!"}},{"$f":"+Zał.1_WPF_bazowy!#REF!","v":{"$error":"#REF!"}},{"$f":"+Zał.1_WPF_bazowy!#REF!","v":{"$error":"#REF!"}},{"$f":"+Zał.1_WPF_bazowy!#REF!","v":{"$error":"#REF!"}},{"$f":"+Zał.1_WPF_bazowy!#REF!","v":{"$error":"#REF!"}}]
[null,"13.4",null,"Wydatki na spłatę przejętych zobowiązań samodzielnego publicznego zakładu opieki zdrowotnej przekształconego na zasadach określonych w przepisach  o działalności leczniczej",{"$f":"Zał.1_WPF_bazowy!E92","v":0},{"$f":"Zał.1_WPF_bazowy!F92","v":0},{"$f":"Zał.1_WPF_bazowy!G92","v":0},{"$f":"Zał.1_WPF_bazowy!H92","v":0},{"$f":"+Zał.1_WPF_bazowy!I92","v":0},{"$f":"+Zał.1_WPF_bazowy!J92","v":0},{"$f":"+Zał.1_WPF_bazowy!K92","v":0},{"$f":"+Zał.1_WPF_bazowy!L92","v":0},{"$f":"+Zał.1_WPF_bazowy!M92","v":0},{"$f":"+Zał.1_WPF_bazowy!N92","v":0},{"$f":"+Zał.1_WPF_bazowy!O92","v":0},{"$f":"+Zał.1_WPF_bazowy!P92","v":0},{"$f":"+Zał.1_WPF_bazowy!Q92","v":0},{"$f":"+Zał.1_WPF_bazowy!#REF!","v":{"$error":"#REF!"}},{"$f":"+Zał.1_WPF_bazowy!#REF!","v":{"$error":"#REF!"}},{"$f":"+Zał.1_WPF_bazowy!#REF!","v":{"$error":"#REF!"}},{"$f":"+Zał.1_WPF_bazowy!#REF!","v":{"$error":"#REF!"}},{"$f":"+Zał.1_WPF_bazowy!#REF!","v":{"$error":"#REF!"}},{"$f":"+Zał.1_WPF_bazowy!#REF!","v":{"$error":"#REF!"}},{"$f":"+Zał.1_WPF_bazowy!#REF!","v":{"$error":"#REF!"}},{"$f":"+Zał.1_WPF_bazowy!#REF!","v":{"$error":"#REF!"}},{"$f":"+Zał.1_WPF_bazowy!#REF!","v":{"$error":"#REF!"}},{"$f":"+Zał.1_WPF_bazowy!#REF!","v":{"$error":"#REF!"}},{"$f":"+Zał.1_WPF_bazowy!#REF!","v":{"$error":"#REF!"}},{"$f":"+Zał.1_WPF_bazowy!#REF!","v":{"$error":"#REF!"}},{"$f":"+Zał.1_WPF_bazowy!#REF!","v":{"$error":"#REF!"}},{"$f":"+Zał.1_WPF_bazowy!#REF!","v":{"$error":"#REF!"}},{"$f":"+Zał.1_WPF_bazowy!#REF!","v":{"$error":"#REF!"}},{"$f":"+Zał.1_WPF_bazowy!#REF!","v":{"$error":"#REF!"}},{"$f":"+Zał.1_WPF_bazowy!#REF!","v":{"$error":"#REF!"}},{"$f":"+Zał.1_WPF_bazowy!#REF!","v":{"$error":"#REF!"}},{"$f":"+Zał.1_WPF_bazowy!#REF!","v":{"$error":"#REF!"}},{"$f":"+Zał.1_WPF_bazowy!#REF!","v":{"$error":"#REF!"}},{"$f":"+Zał.1_WPF_bazowy!#REF!","v":{"$error":"#REF!"}}]
[null,"13.5",null,"Wydatki na spłatę przejętych zobowiązań samodzielnego publicznego zakładu opieki zdrowotnej likwidowanego na zasadach określonych w przepisach  o działalności leczniczej",{"$f":"Zał.1_WPF_bazowy!E93","v":0},{"$f":"Zał.1_WPF_bazowy!F93","v":0},{"$f":"Zał.1_WPF_bazowy!G93","v":0},{"$f":"Zał.1_WPF_bazowy!H93","v":0},{"$f":"+Zał.1_WPF_bazowy!I93","v":0},{"$f":"+Zał.1_WPF_bazowy!J93","v":0},{"$f":"+Zał.1_WPF_bazowy!K93","v":0},{"$f":"+Zał.1_WPF_bazowy!L93","v":0},{"$f":"+Zał.1_WPF_bazowy!M93","v":0},{"$f":"+Zał.1_WPF_bazowy!N93","v":0},{"$f":"+Zał.1_WPF_bazowy!O93","v":0},{"$f":"+Zał.1_WPF_bazowy!P93","v":0},{"$f":"+Zał.1_WPF_bazowy!Q93","v":0},{"$f":"+Zał.1_WPF_bazowy!#REF!","v":{"$error":"#REF!"}},{"$f":"+Zał.1_WPF_bazowy!#REF!","v":{"$error":"#REF!"}},{"$f":"+Zał.1_WPF_bazowy!#REF!","v":{"$error":"#REF!"}},{"$f":"+Zał.1_WPF_bazowy!#REF!","v":{"$error":"#REF!"}},{"$f":"+Zał.1_WPF_bazowy!#REF!","v":{"$error":"#REF!"}},{"$f":"+Zał.1_WPF_bazowy!#REF!","v":{"$error":"#REF!"}},{"$f":"+Zał.1_WPF_bazowy!#REF!","v":{"$error":"#REF!"}},{"$f":"+Zał.1_WPF_bazowy!#REF!","v":{"$error":"#REF!"}},{"$f":"+Zał.1_WPF_bazowy!#REF!","v":{"$error":"#REF!"}},{"$f":"+Zał.1_WPF_bazowy!#REF!","v":{"$error":"#REF!"}},{"$f":"+Zał.1_WPF_bazowy!#REF!","v":{"$error":"#REF!"}},{"$f":"+Zał.1_WPF_bazowy!#REF!","v":{"$error":"#REF!"}},{"$f":"+Zał.1_WPF_bazowy!#REF!","v":{"$error":"#REF!"}},{"$f":"+Zał.1_WPF_bazowy!#REF!","v":{"$error":"#REF!"}},{"$f":"+Zał.1_WPF_bazowy!#REF!","v":{"$error":"#REF!"}},{"$f":"+Zał.1_WPF_bazowy!#REF!","v":{"$error":"#REF!"}},{"$f":"+Zał.1_WPF_bazowy!#REF!","v":{"$error":"#REF!"}},{"$f":"+Zał.1_WPF_bazowy!#REF!","v":{"$error":"#REF!"}},{"$f":"+Zał.1_WPF_bazowy!#REF!","v":{"$error":"#REF!"}},{"$f":"+Zał.1_WPF_bazowy!#REF!","v":{"$error":"#REF!"}},{"$f":"+Zał.1_WPF_bazowy!#REF!","v":{"$error":"#REF!"}}]
[null,"13.6",null,"Wydatki na spłatę zobowiązań samodzielnego publicznego zakładu opieki zdrowotnej przejętych do końca 2011 r. na podstawie przepisów o zakładach opieki zdrowotnej",{"$f":"Zał.1_WPF_bazowy!E94","v":0},{"$f":"Zał.1_WPF_bazowy!F94","v":0},{"$f":"Zał.1_WPF_bazowy!G94","v":0},{"$f":"Zał.1_WPF_bazowy!H94","v":0},{"$f":"+Zał.1_WPF_bazowy!I94","v":0},{"$f":"+Zał.1_WPF_bazowy!J94","v":0},{"$f":"+Zał.1_WPF_bazowy!K94","v":0},{"$f":"+Zał.1_WPF_bazowy!L94","v":0},{"$f":"+Zał.1_WPF_bazowy!M94","v":0},{"$f":"+Zał.1_WPF_bazowy!N94","v":0},{"$f":"+Zał.1_WPF_bazowy!O94","v":0},{"$f":"+Zał.1_WPF_bazowy!P94","v":0},{"$f":"+Zał.1_WPF_bazowy!Q94","v":0},{"$f":"+Zał.1_WPF_bazowy!#REF!","v":{"$error":"#REF!"}},{"$f":"+Zał.1_WPF_bazowy!#REF!","v":{"$error":"#REF!"}},{"$f":"+Zał.1_WPF_bazowy!#REF!","v":{"$error":"#REF!"}},{"$f":"+Zał.1_WPF_bazowy!#REF!","v":{"$error":"#REF!"}},{"$f":"+Zał.1_WPF_bazowy!#REF!","v":{"$error":"#REF!"}},{"$f":"+Zał.1_WPF_bazowy!#REF!","v":{"$error":"#REF!"}},{"$f":"+Zał.1_WPF_bazowy!#REF!","v":{"$error":"#REF!"}},{"$f":"+Zał.1_WPF_bazowy!#REF!","v":{"$error":"#REF!"}},{"$f":"+Zał.1_WPF_bazowy!#REF!","v":{"$error":"#REF!"}},{"$f":"+Zał.1_WPF_bazowy!#REF!","v":{"$error":"#REF!"}},{"$f":"+Zał.1_WPF_bazowy!#REF!","v":{"$error":"#REF!"}},{"$f":"+Zał.1_WPF_bazowy!#REF!","v":{"$error":"#REF!"}},{"$f":"+Zał.1_WPF_bazowy!#REF!","v":{"$error":"#REF!"}},{"$f":"+Zał.1_WPF_bazowy!#REF!","v":{"$error":"#REF!"}},{"$f":"+Zał.1_WPF_bazowy!#REF!","v":{"$error":"#REF!"}},{"$f":"+Zał.1_WPF_bazowy!#REF!","v":{"$error":"#REF!"}},{"$f":"+Zał.1_WPF_bazowy!#REF!","v":{"$error":"#REF!"}},{"$f":"+Zał.1_WPF_bazowy!#REF!","v":{"$error":"#REF!"}},{"$f":"+Zał.1_WPF_bazowy!#REF!","v":{"$error":"#REF!"}},{"$f":"+Zał.1_WPF_bazowy!#REF!","v":{"$error":"#REF!"}},{"$f":"+Zał.1_WPF_bazowy!#REF!","v":{"$error":"#REF!"}}]
[null,"13.7",null,"Wydatki bieżące na pokrycie ujemnego wyniku finansowego samodzielnego publicznego zakładu opieki zdrowotnej",{"$f":"Zał.1_WPF_bazowy!E95","v":0},{"$f":"Zał.1_WPF_bazowy!F95","v":0},{"$f":"Zał.1_WPF_bazowy!G95","v":0},{"$f":"Zał.1_WPF_bazowy!H95","v":0},{"$f":"+Zał.1_WPF_bazowy!I95","v":0},{"$f":"+Zał.1_WPF_bazowy!J95","v":0},{"$f":"+Zał.1_WPF_bazowy!K95","v":0},{"$f":"+Zał.1_WPF_bazowy!L95","v":0},{"$f":"+Zał.1_WPF_bazowy!M95","v":0},{"$f":"+Zał.1_WPF_bazowy!N95","v":0},{"$f":"+Zał.1_WPF_bazowy!O95","v":0},{"$f":"+Zał.1_WPF_bazowy!P95","v":0},{"$f":"+Zał.1_WPF_bazowy!Q95","v":0},{"$f":"+Zał.1_WPF_bazowy!#REF!","v":{"$error":"#REF!"}},{"$f":"+Zał.1_WPF_bazowy!#REF!","v":{"$error":"#REF!"}},{"$f":"+Zał.1_WPF_bazowy!#REF!","v":{"$error":"#REF!"}},{"$f":"+Zał.1_WPF_bazowy!#REF!","v":{"$error":"#REF!"}},{"$f":"+Zał.1_WPF_bazowy!#REF!","v":{"$error":"#REF!"}},{"$f":"+Zał.1_WPF_bazowy!#REF!","v":{"$error":"#REF!"}},{"$f":"+Zał.1_WPF_bazowy!#REF!","v":{"$error":"#REF!"}},{"$f":"+Zał.1_WPF_bazowy!#REF!","v":{"$error":"#REF!"}},{"$f":"+Zał.1_WPF_bazowy!#REF!","v":{"$error":"#REF!"}},{"$f":"+Zał.1_WPF_bazowy!#REF!","v":{"$error":"#REF!"}},{"$f":"+Zał.1_WPF_bazowy!#REF!","v":{"$error":"#REF!"}},{"$f":"+Zał.1_WPF_bazowy!#REF!","v":{"$error":"#REF!"}},{"$f":"+Zał.1_WPF_bazowy!#REF!","v":{"$error":"#REF!"}},{"$f":"+Zał.1_WPF_bazowy!#REF!","v":{"$error":"#REF!"}},{"$f":"+Zał.1_WPF_bazowy!#REF!","v":{"$error":"#REF!"}},{"$f":"+Zał.1_WPF_bazowy!#REF!","v":{"$error":"#REF!"}},{"$f":"+Zał.1_WPF_bazowy!#REF!","v":{"$error":"#REF!"}},{"$f":"+Zał.1_WPF_bazowy!#REF!","v":{"$error":"#REF!"}},{"$f":"+Zał.1_WPF_bazowy!#REF!","v":{"$error":"#REF!"}},{"$f":"+Zał.1_WPF_bazowy!#REF!","v":{"$error":"#REF!"}},{"$f":"+Zał.1_WPF_bazowy!#REF!","v":{"$error":"#REF!"}}]
["x",14,null,"Dane uzupełniające o długu i jego spłacie","x","x","x","x","x","x","x","x","x","x","x","x","x","x","x","x","x","x","x","x","x","x","x","x","x","x","x","x","x","x","x","x","x","x"]
["x","14.1",null,"Spłaty rat kapitałowych oraz wykup papierów wartościowych, o których mowa w pkt. 5.1., wynikające wyłącznie z tytułu zobowiązań już zaciągniętych",{"$f":"Zał.1_WPF_bazowy!E97","v":4709034.88},{"$f":"Zał.1_WPF_bazowy!F97","v":2026525.28},{"$f":"Zał.1_WPF_bazowy!G97","v":915692},{"$f":"Zał.1_WPF_bazowy!H97","v":915692},{"$f":"+Zał.1_WPF_bazowy!I97","v":1215692},{"$f":"+Zał.1_WPF_bazowy!J97","v":1478204},{"$f":"+Zał.1_WPF_bazowy!K97","v":1678204},{"$f":"+Zał.1_WPF_bazowy!L97","v":1860004},{"$f":"+Zał.1_WPF_bazowy!M97","v":2210004},{"$f":"+Zał.1_WPF_bazowy!N97","v":2210004},{"$f":"+Zał.1_WPF_bazowy!O97","v":2250004},{"$f":"+Zał.1_WPF_bazowy!P97","v":2418000},{"$f":"+Zał.1_WPF_bazowy!Q97","v":1250000},{"$f":"+Zał.1_WPF_bazowy!#REF!","v":{"$error":"#REF!"}},{"$f":"+Zał.1_WPF_bazowy!#REF!","v":{"$error":"#REF!"}},{"$f":"+Zał.1_WPF_bazowy!#REF!","v":{"$error":"#REF!"}},{"$f":"+Zał.1_WPF_bazowy!#REF!","v":{"$error":"#REF!"}},{"$f":"+Zał.1_WPF_bazowy!#REF!","v":{"$error":"#REF!"}},{"$f":"+Zał.1_WPF_bazowy!#REF!","v":{"$error":"#REF!"}},{"$f":"+Zał.1_WPF_bazowy!#REF!","v":{"$error":"#REF!"}},{"$f":"+Zał.1_WPF_bazowy!#REF!","v":{"$error":"#REF!"}},{"$f":"+Zał.1_WPF_bazowy!#REF!","v":{"$error":"#REF!"}},{"$f":"+Zał.1_WPF_bazowy!#REF!","v":{"$error":"#REF!"}},{"$f":"+Zał.1_WPF_bazowy!#REF!","v":{"$error":"#REF!"}},{"$f":"+Zał.1_WPF_bazowy!#REF!","v":{"$error":"#REF!"}},{"$f":"+Zał.1_WPF_bazowy!#REF!","v":{"$error":"#REF!"}},{"$f":"+Zał.1_WPF_bazowy!#REF!","v":{"$error":"#REF!"}},{"$f":"+Zał.1_WPF_bazowy!#REF!","v":{"$error":"#REF!"}},{"$f":"+Zał.1_WPF_bazowy!#REF!","v":{"$error":"#REF!"}},{"$f":"+Zał.1_WPF_bazowy!#REF!","v":{"$error":"#REF!"}},{"$f":"+Zał.1_WPF_bazowy!#REF!","v":{"$error":"#REF!"}},{"$f":"+Zał.1_WPF_bazowy!#REF!","v":{"$error":"#REF!"}},{"$f":"+Zał.1_WPF_bazowy!#REF!","v":{"$error":"#REF!"}},{"$f":"+Zał.1_WPF_bazowy!#REF!","v":{"$error":"#REF!"}}]
["x","14.2",null,"Kwota długu, którego planowana spłata dokona się z wydatków budżetu",{"$f":"Zał.1_WPF_bazowy!E98","v":0},{"$f":"Zał.1_WPF_bazowy!F98","v":0},{"$f":"Zał.1_WPF_bazowy!G98","v":0},{"$f":"Zał.1_WPF_bazowy!H98","v":0},{"$f":"+Zał.1_WPF_bazowy!I98","v":0},{"$f":"+Zał.1_WPF_bazowy!J98","v":0},{"$f":"+Zał.1_WPF_bazowy!K98","v":0},{"$f":"+Zał.1_WPF_bazowy!L98","v":0},{"$f":"+Zał.1_WPF_bazowy!M98","v":0},{"$f":"+Zał.1_WPF_bazowy!N98","v":0},{"$f":"+Zał.1_WPF_bazowy!O98","v":0},{"$f":"+Zał.1_WPF_bazowy!P98","v":0},{"$f":"+Zał.1_WPF_bazowy!Q98","v":0},{"$f":"+Zał.1_WPF_bazowy!#REF!","v":{"$error":"#REF!"}},{"$f":"+Zał.1_WPF_bazowy!#REF!","v":{"$error":"#REF!"}},{"$f":"+Zał.1_WPF_bazowy!#REF!","v":{"$error":"#REF!"}},{"$f":"+Zał.1_WPF_bazowy!#REF!","v":{"$error":"#REF!"}},{"$f":"+Zał.1_WPF_bazowy!#REF!","v":{"$error":"#REF!"}},{"$f":"+Zał.1_WPF_bazowy!#REF!","v":{"$error":"#REF!"}},{"$f":"+Zał.1_WPF_bazowy!#REF!","v":{"$error":"#REF!"}},{"$f":"+Zał.1_WPF_bazowy!#REF!","v":{"$error":"#REF!"}},{"$f":"+Zał.1_WPF_bazowy!#REF!","v":{"$error":"#REF!"}},{"$f":"+Zał.1_WPF_bazowy!#REF!","v":{"$error":"#REF!"}},{"$f":"+Zał.1_WPF_bazowy!#REF!","v":{"$error":"#REF!"}},{"$f":"+Zał.1_WPF_bazowy!#REF!","v":{"$error":"#REF!"}},{"$f":"+Zał.1_WPF_bazowy!#REF!","v":{"$error":"#REF!"}},{"$f":"+Zał.1_WPF_bazowy!#REF!","v":{"$error":"#REF!"}},{"$f":"+Zał.1_WPF_bazowy!#REF!","v":{"$error":"#REF!"}},{"$f":"+Zał.1_WPF_bazowy!#REF!","v":{"$error":"#REF!"}},{"$f":"+Zał.1_WPF_bazowy!#REF!","v":{"$error":"#REF!"}},{"$f":"+Zał.1_WPF_bazowy!#REF!","v":{"$error":"#REF!"}},{"$f":"+Zał.1_WPF_bazowy!#REF!","v":{"$error":"#REF!"}},{"$f":"+Zał.1_WPF_bazowy!#REF!","v":{"$error":"#REF!"}},{"$f":"+Zał.1_WPF_bazowy!#REF!","v":{"$error":"#REF!"}}]
["x","14.3",null,"Wydatki zmniejszające dług, w tym",{"$f":"Zał.1_WPF_bazowy!E99","v":0},{"$f":"Zał.1_WPF_bazowy!F99","v":0},{"$f":"Zał.1_WPF_bazowy!G99","v":0},{"$f":"Zał.1_WPF_bazowy!H99","v":0},{"$f":"+Zał.1_WPF_bazowy!I99","v":0},{"$f":"+Zał.1_WPF_bazowy!J99","v":0},{"$f":"+Zał.1_WPF_bazowy!K99","v":0},{"$f":"+Zał.1_WPF_bazowy!L99","v":0},{"$f":"+Zał.1_WPF_bazowy!M99","v":0},{"$f":"+Zał.1_WPF_bazowy!N99","v":0},{"$f":"+Zał.1_WPF_bazowy!O99","v":0},{"$f":"+Zał.1_WPF_bazowy!P99","v":0},{"$f":"+Zał.1_WPF_bazowy!Q99","v":0},{"$f":"+Zał.1_WPF_bazowy!#REF!","v":{"$error":"#REF!"}},{"$f":"+Zał.1_WPF_bazowy!#REF!","v":{"$error":"#REF!"}},{"$f":"+Zał.1_WPF_bazowy!#REF!","v":{"$error":"#REF!"}},{"$f":"+Zał.1_WPF_bazowy!#REF!","v":{"$error":"#REF!"}},{"$f":"+Zał.1_WPF_bazowy!#REF!","v":{"$error":"#REF!"}},{"$f":"+Zał.1_WPF_bazowy!#REF!","v":{"$error":"#REF!"}},{"$f":"+Zał.1_WPF_bazowy!#REF!","v":{"$error":"#REF!"}},{"$f":"+Zał.1_WPF_bazowy!#REF!","v":{"$error":"#REF!"}},{"$f":"+Zał.1_WPF_bazowy!#REF!","v":{"$error":"#REF!"}},{"$f":"+Zał.1_WPF_bazowy!#REF!","v":{"$error":"#REF!"}},{"$f":"+Zał.1_WPF_bazowy!#REF!","v":{"$error":"#REF!"}},{"$f":"+Zał.1_WPF_bazowy!#REF!","v":{"$error":"#REF!"}},{"$f":"+Zał.1_WPF_bazowy!#REF!","v":{"$error":"#REF!"}},{"$f":"+Zał.1_WPF_bazowy!#REF!","v":{"$error":"#REF!"}},{"$f":"+Zał.1_WPF_bazowy!#REF!","v":{"$error":"#REF!"}},{"$f":"+Zał.1_WPF_bazowy!#REF!","v":{"$error":"#REF!"}},{"$f":"+Zał.1_WPF_bazowy!#REF!","v":{"$error":"#REF!"}},{"$f":"+Zał.1_WPF_bazowy!#REF!","v":{"$error":"#REF!"}},{"$f":"+Zał.1_WPF_bazowy!#REF!","v":{"$error":"#REF!"}},{"$f":"+Zał.1_WPF_bazowy!#REF!","v":{"$error":"#REF!"}},{"$f":"+Zał.1_WPF_bazowy!#REF!","v":{"$error":"#REF!"}}]
["x","14.3.1",null,"spłata zobowiązań wymagalnych z lat poprzednich, innych niż w pkt 14.3.3",{"$f":"Zał.1_WPF_bazowy!E100","v":0},{"$f":"Zał.1_WPF_bazowy!F100","v":0},{"$f":"Zał.1_WPF_bazowy!G100","v":0},{"$f":"Zał.1_WPF_bazowy!H100","v":0},{"$f":"+Zał.1_WPF_bazowy!I100","v":0},{"$f":"+Zał.1_WPF_bazowy!J100","v":0},{"$f":"+Zał.1_WPF_bazowy!K100","v":0},{"$f":"+Zał.1_WPF_bazowy!L100","v":0},{"$f":"+Zał.1_WPF_bazowy!M100","v":0},{"$f":"+Zał.1_WPF_bazowy!N100","v":0},{"$f":"+Zał.1_WPF_bazowy!O100","v":0},{"$f":"+Zał.1_WPF_bazowy!P100","v":0},{"$f":"+Zał.1_WPF_bazowy!Q100","v":0},{"$f":"+Zał.1_WPF_bazowy!#REF!","v":{"$error":"#REF!"}},{"$f":"+Zał.1_WPF_bazowy!#REF!","v":{"$error":"#REF!"}},{"$f":"+Zał.1_WPF_bazowy!#REF!","v":{"$error":"#REF!"}},{"$f":"+Zał.1_WPF_bazowy!#REF!","v":{"$error":"#REF!"}},{"$f":"+Zał.1_WPF_bazowy!#REF!","v":{"$error":"#REF!"}},{"$f":"+Zał.1_WPF_bazowy!#REF!","v":{"$error":"#REF!"}},{"$f":"+Zał.1_WPF_bazowy!#REF!","v":{"$error":"#REF!"}},{"$f":"+Zał.1_WPF_bazowy!#REF!","v":{"$error":"#REF!"}},{"$f":"+Zał.1_WPF_bazowy!#REF!","v":{"$error":"#REF!"}},{"$f":"+Zał.1_WPF_bazowy!#REF!","v":{"$error":"#REF!"}},{"$f":"+Zał.1_WPF_bazowy!#REF!","v":{"$error":"#REF!"}},{"$f":"+Zał.1_WPF_bazowy!#REF!","v":{"$error":"#REF!"}},{"$f":"+Zał.1_WPF_bazowy!#REF!","v":{"$error":"#REF!"}},{"$f":"+Zał.1_WPF_bazowy!#REF!","v":{"$error":"#REF!"}},{"$f":"+Zał.1_WPF_bazowy!#REF!","v":{"$error":"#REF!"}},{"$f":"+Zał.1_WPF_bazowy!#REF!","v":{"$error":"#REF!"}},{"$f":"+Zał.1_WPF_bazowy!#REF!","v":{"$error":"#REF!"}},{"$f":"+Zał.1_WPF_bazowy!#REF!","v":{"$error":"#REF!"}},{"$f":"+Zał.1_WPF_bazowy!#REF!","v":{"$error":"#REF!"}},{"$f":"+Zał.1_WPF_bazowy!#REF!","v":{"$error":"#REF!"}},{"$f":"+Zał.1_WPF_bazowy!#REF!","v":{"$error":"#REF!"}}]
["x","14.3.2",null,"związane z umowami zaliczanymi do tytułów dłużnych wliczanych do państwowego długu publicznego",{"$f":"Zał.1_WPF_bazowy!E101","v":0},{"$f":"Zał.1_WPF_bazowy!F101","v":0},{"$f":"Zał.1_WPF_bazowy!G101","v":0},{"$f":"Zał.1_WPF_bazowy!H101","v":0},{"$f":"+Zał.1_WPF_bazowy!I101","v":0},{"$f":"+Zał.1_WPF_bazowy!J101","v":0},{"$f":"+Zał.1_WPF_bazowy!K101","v":0},{"$f":"+Zał.1_WPF_bazowy!L101","v":0},{"$f":"+Zał.1_WPF_bazowy!M101","v":0},{"$f":"+Zał.1_WPF_bazowy!N101","v":0},{"$f":"+Zał.1_WPF_bazowy!O101","v":0},{"$f":"+Zał.1_WPF_bazowy!P101","v":0},{"$f":"+Zał.1_WPF_bazowy!Q101","v":0},{"$f":"+Zał.1_WPF_bazowy!#REF!","v":{"$error":"#REF!"}},{"$f":"+Zał.1_WPF_bazowy!#REF!","v":{"$error":"#REF!"}},{"$f":"+Zał.1_WPF_bazowy!#REF!","v":{"$error":"#REF!"}},{"$f":"+Zał.1_WPF_bazowy!#REF!","v":{"$error":"#REF!"}},{"$f":"+Zał.1_WPF_bazowy!#REF!","v":{"$error":"#REF!"}},{"$f":"+Zał.1_WPF_bazowy!#REF!","v":{"$error":"#REF!"}},{"$f":"+Zał.1_WPF_bazowy!#REF!","v":{"$error":"#REF!"}},{"$f":"+Zał.1_WPF_bazowy!#REF!","v":{"$error":"#REF!"}},{"$f":"+Zał.1_WPF_bazowy!#REF!","v":{"$error":"#REF!"}},{"$f":"+Zał.1_WPF_bazowy!#REF!","v":{"$error":"#REF!"}},{"$f":"+Zał.1_WPF_bazowy!#REF!","v":{"$error":"#REF!"}},{"$f":"+Zał.1_WPF_bazowy!#REF!","v":{"$error":"#REF!"}},{"$f":"+Zał.1_WPF_bazowy!#REF!","v":{"$error":"#REF!"}},{"$f":"+Zał.1_WPF_bazowy!#REF!","v":{"$error":"#REF!"}},{"$f":"+Zał.1_WPF_bazowy!#REF!","v":{"$error":"#REF!"}},{"$f":"+Zał.1_WPF_bazowy!#REF!","v":{"$error":"#REF!"}},{"$f":"+Zał.1_WPF_bazowy!#REF!","v":{"$error":"#REF!"}},{"$f":"+Zał.1_WPF_bazowy!#REF!","v":{"$error":"#REF!"}},{"$f":"+Zał.1_WPF_bazowy!#REF!","v":{"$error":"#REF!"}},{"$f":"+Zał.1_WPF_bazowy!#REF!","v":{"$error":"#REF!"}},{"$f":"+Zał.1_WPF_bazowy!#REF!","v":{"$error":"#REF!"}}]
["x","14.3.3",null,"wypłaty z tytułu wymagalnych poręczeń i gwarancji",{"$f":"Zał.1_WPF_bazowy!E102","v":0},{"$f":"Zał.1_WPF_bazowy!F102","v":0},{"$f":"Zał.1_WPF_bazowy!G102","v":0},{"$f":"Zał.1_WPF_bazowy!H102","v":0},{"$f":"+Zał.1_WPF_bazowy!I102","v":0},{"$f":"+Zał.1_WPF_bazowy!J102","v":0},{"$f":"+Zał.1_WPF_bazowy!K102","v":0},{"$f":"+Zał.1_WPF_bazowy!L102","v":0},{"$f":"+Zał.1_WPF_bazowy!M102","v":0},{"$f":"+Zał.1_WPF_bazowy!N102","v":0},{"$f":"+Zał.1_WPF_bazowy!O102","v":0},{"$f":"+Zał.1_WPF_bazowy!P102","v":0},{"$f":"+Zał.1_WPF_bazowy!Q102","v":0},{"$f":"+Zał.1_WPF_bazowy!#REF!","v":{"$error":"#REF!"}},{"$f":"+Zał.1_WPF_bazowy!#REF!","v":{"$error":"#REF!"}},{"$f":"+Zał.1_WPF_bazowy!#REF!","v":{"$error":"#REF!"}},{"$f":"+Zał.1_WPF_bazowy!#REF!","v":{"$error":"#REF!"}},{"$f":"+Zał.1_WPF_bazowy!#REF!","v":{"$error":"#REF!"}},{"$f":"+Zał.1_WPF_bazowy!#REF!","v":{"$error":"#REF!"}},{"$f":"+Zał.1_WPF_bazowy!#REF!","v":{"$error":"#REF!"}},{"$f":"+Zał.1_WPF_bazowy!#REF!","v":{"$error":"#REF!"}},{"$f":"+Zał.1_WPF_bazowy!#REF!","v":{"$error":"#REF!"}},{"$f":"+Zał.1_WPF_bazowy!#REF!","v":{"$error":"#REF!"}},{"$f":"+Zał.1_WPF_bazowy!#REF!","v":{"$error":"#REF!"}},{"$f":"+Zał.1_WPF_bazowy!#REF!","v":{"$error":"#REF!"}},{"$f":"+Zał.1_WPF_bazowy!#REF!","v":{"$error":"#REF!"}},{"$f":"+Zał.1_WPF_bazowy!#REF!","v":{"$error":"#REF!"}},{"$f":"+Zał.1_WPF_bazowy!#REF!","v":{"$error":"#REF!"}},{"$f":"+Zał.1_WPF_bazowy!#REF!","v":{"$error":"#REF!"}},{"$f":"+Zał.1_WPF_bazowy!#REF!","v":{"$error":"#REF!"}},{"$f":"+Zał.1_WPF_bazowy!#REF!","v":{"$error":"#REF!"}},{"$f":"+Zał.1_WPF_bazowy!#REF!","v":{"$error":"#REF!"}},{"$f":"+Zał.1_WPF_bazowy!#REF!","v":{"$error":"#REF!"}},{"$f":"+Zał.1_WPF_bazowy!#REF!","v":{"$error":"#REF!"}}]
["x","14.4",null,"Wynik operacji niekasowych wpływających na kwotę długu ( m.in. umorzenia, różnice kursowe)",{"$f":"Zał.1_WPF_bazowy!E103","v":0},{"$f":"Zał.1_WPF_bazowy!F103","v":0},{"$f":"Zał.1_WPF_bazowy!G103","v":0},{"$f":"Zał.1_WPF_bazowy!H103","v":0},{"$f":"+Zał.1_WPF_bazowy!I103","v":0},{"$f":"+Zał.1_WPF_bazowy!J103","v":0},{"$f":"+Zał.1_WPF_bazowy!K103","v":0},{"$f":"+Zał.1_WPF_bazowy!L103","v":0},{"$f":"+Zał.1_WPF_bazowy!M103","v":0},{"$f":"+Zał.1_WPF_bazowy!N103","v":0},{"$f":"+Zał.1_WPF_bazowy!O103","v":0},{"$f":"+Zał.1_WPF_bazowy!P103","v":0},{"$f":"+Zał.1_WPF_bazowy!Q103","v":0},{"$f":"+Zał.1_WPF_bazowy!#REF!","v":{"$error":"#REF!"}},{"$f":"+Zał.1_WPF_bazowy!#REF!","v":{"$error":"#REF!"}},{"$f":"+Zał.1_WPF_bazowy!#REF!","v":{"$error":"#REF!"}},{"$f":"+Zał.1_WPF_bazowy!#REF!","v":{"$error":"#REF!"}},{"$f":"+Zał.1_WPF_bazowy!#REF!","v":{"$error":"#REF!"}},{"$f":"+Zał.1_WPF_bazowy!#REF!","v":{"$error":"#REF!"}},{"$f":"+Zał.1_WPF_bazowy!#REF!","v":{"$error":"#REF!"}},{"$f":"+Zał.1_WPF_bazowy!#REF!","v":{"$error":"#REF!"}},{"$f":"+Zał.1_WPF_bazowy!#REF!","v":{"$error":"#REF!"}},{"$f":"+Zał.1_WPF_bazowy!#REF!","v":{"$error":"#REF!"}},{"$f":"+Zał.1_WPF_bazowy!#REF!","v":{"$error":"#REF!"}},{"$f":"+Zał.1_WPF_bazowy!#REF!","v":{"$error":"#REF!"}},{"$f":"+Zał.1_WPF_bazowy!#REF!","v":{"$error":"#REF!"}},{"$f":"+Zał.1_WPF_bazowy!#REF!","v":{"$error":"#REF!"}},{"$f":"+Zał.1_WPF_bazowy!#REF!","v":{"$error":"#REF!"}},{"$f":"+Zał.1_WPF_bazowy!#REF!","v":{"$error":"#REF!"}},{"$f":"+Zał.1_WPF_bazowy!#REF!","v":{"$error":"#REF!"}},{"$f":"+Zał.1_WPF_bazowy!#REF!","v":{"$error":"#REF!"}},{"$f":"+Zał.1_WPF_bazowy!#REF!","v":{"$error":"#REF!"}},{"$f":"+Zał.1_WPF_bazowy!#REF!","v":{"$error":"#REF!"}},{"$f":"+Zał.1_WPF_bazowy!#REF!","v":{"$error":"#REF!"}}]
[null,15,null,"Dane dotyczące emitowanych obligacji przychodowych","x","x","x","x","x","x","x","x","x","x","x","x","x","x","x","x","x","x","x","x","x","x","x","x","x","x","x","x","x","x","x","x","x","x"]
[null,"15.1",null,"Środki z przedsięwzięcia gromadzone na rachunku bankowym,  w tym:",{"$f":"Zał.1_WPF_bazowy!E105","v":0},{"$f":"Zał.1_WPF_bazowy!F105","v":0},{"$f":"Zał.1_WPF_bazowy!G105","v":0},{"$f":"Zał.1_WPF_bazowy!H105","v":0},{"$f":"+Zał.1_WPF_bazowy!I105","v":0},{"$f":"+Zał.1_WPF_bazowy!J105","v":0},{"$f":"+Zał.1_WPF_bazowy!K105","v":0},{"$f":"+Zał.1_WPF_bazowy!L105","v":0},{"$f":"+Zał.1_WPF_bazowy!M105","v":0},{"$f":"+Zał.1_WPF_bazowy!N105","v":0},{"$f":"+Zał.1_WPF_bazowy!O105","v":0},{"$f":"+Zał.1_WPF_bazowy!P105","v":0},{"$f":"+Zał.1_WPF_bazowy!Q105","v":0},{"$f":"+Zał.1_WPF_bazowy!#REF!","v":{"$error":"#REF!"}},{"$f":"+Zał.1_WPF_bazowy!#REF!","v":{"$error":"#REF!"}},{"$f":"+Zał.1_WPF_bazowy!#REF!","v":{"$error":"#REF!"}},{"$f":"+Zał.1_WPF_bazowy!#REF!","v":{"$error":"#REF!"}},{"$f":"+Zał.1_WPF_bazowy!#REF!","v":{"$error":"#REF!"}},{"$f":"+Zał.1_WPF_bazowy!#REF!","v":{"$error":"#REF!"}},{"$f":"+Zał.1_WPF_bazowy!#REF!","v":{"$error":"#REF!"}},{"$f":"+Zał.1_WPF_bazowy!#REF!","v":{"$error":"#REF!"}},{"$f":"+Zał.1_WPF_bazowy!#REF!","v":{"$error":"#REF!"}},{"$f":"+Zał.1_WPF_bazowy!#REF!","v":{"$error":"#REF!"}},{"$f":"+Zał.1_WPF_bazowy!#REF!","v":{"$error":"#REF!"}},{"$f":"+Zał.1_WPF_bazowy!#REF!","v":{"$error":"#REF!"}},{"$f":"+Zał.1_WPF_bazowy!#REF!","v":{"$error":"#REF!"}},{"$f":"+Zał.1_WPF_bazowy!#REF!","v":{"$error":"#REF!"}},{"$f":"+Zał.1_WPF_bazowy!#REF!","v":{"$error":"#REF!"}},{"$f":"+Zał.1_WPF_bazowy!#REF!","v":{"$error":"#REF!"}},{"$f":"+Zał.1_WPF_bazowy!#REF!","v":{"$error":"#REF!"}},{"$f":"+Zał.1_WPF_bazowy!#REF!","v":{"$error":"#REF!"}},{"$f":"+Zał.1_WPF_bazowy!#REF!","v":{"$error":"#REF!"}},{"$f":"+Zał.1_WPF_bazowy!#REF!","v":{"$error":"#REF!"}},{"$f":"+Zał.1_WPF_bazowy!#REF!","v":{"$error":"#REF!"}}]
["x","15.1.1",null,"środki na zaspokojenie roszczeń obligatariuszy",{"$f":"Zał.1_WPF_bazowy!E106","v":0},{"$f":"Zał.1_WPF_bazowy!F106","v":0},{"$f":"Zał.1_WPF_bazowy!G106","v":0},{"$f":"Zał.1_WPF_bazowy!H106","v":0},{"$f":"+Zał.1_WPF_bazowy!I106","v":0},{"$f":"+Zał.1_WPF_bazowy!J106","v":0},{"$f":"+Zał.1_WPF_bazowy!K106","v":0},{"$f":"+Zał.1_WPF_bazowy!L106","v":0},{"$f":"+Zał.1_WPF_bazowy!M106","v":0},{"$f":"+Zał.1_WPF_bazowy!N106","v":0},{"$f":"+Zał.1_WPF_bazowy!O106","v":0},{"$f":"+Zał.1_WPF_bazowy!P106","v":0},{"$f":"+Zał.1_WPF_bazowy!Q106","v":0},{"$f":"+Zał.1_WPF_bazowy!#REF!","v":{"$error":"#REF!"}},{"$f":"+Zał.1_WPF_bazowy!#REF!","v":{"$error":"#REF!"}},{"$f":"+Zał.1_WPF_bazowy!#REF!","v":{"$error":"#REF!"}},{"$f":"+Zał.1_WPF_bazowy!#REF!","v":{"$error":"#REF!"}},{"$f":"+Zał.1_WPF_bazowy!#REF!","v":{"$error":"#REF!"}},{"$f":"+Zał.1_WPF_bazowy!#REF!","v":{"$error":"#REF!"}},{"$f":"+Zał.1_WPF_bazowy!#REF!","v":{"$error":"#REF!"}},{"$f":"+Zał.1_WPF_bazowy!#REF!","v":{"$error":"#REF!"}},{"$f":"+Zał.1_WPF_bazowy!#REF!","v":{"$error":"#REF!"}},{"$f":"+Zał.1_WPF_bazowy!#REF!","v":{"$error":"#REF!"}},{"$f":"+Zał.1_WPF_bazowy!#REF!","v":{"$error":"#REF!"}},{"$f":"+Zał.1_WPF_bazowy!#REF!","v":{"$error":"#REF!"}},{"$f":"+Zał.1_WPF_bazowy!#REF!","v":{"$error":"#REF!"}},{"$f":"+Zał.1_WPF_bazowy!#REF!","v":{"$error":"#REF!"}},{"$f":"+Zał.1_WPF_bazowy!#REF!","v":{"$error":"#REF!"}},{"$f":"+Zał.1_WPF_bazowy!#REF!","v":{"$error":"#REF!"}},{"$f":"+Zał.1_WPF_bazowy!#REF!","v":{"$error":"#REF!"}},{"$f":"+Zał.1_WPF_bazowy!#REF!","v":{"$error":"#REF!"}},{"$f":"+Zał.1_WPF_bazowy!#REF!","v":{"$error":"#REF!"}},{"$f":"+Zał.1_WPF_bazowy!#REF!","v":{"$error":"#REF!"}},{"$f":"+Zał.1_WPF_bazowy!#REF!","v":{"$error":"#REF!"}}]
["x","15.2",null,"Wydatki bieżące z tytułu świadczenia emitenta należnego obligatariuszom,  nieuwzględniane  w limicie spłaty zobowiązań, o którym mowa w art. 243 ustawy",{"$f":"Zał.1_WPF_bazowy!E107","v":0},{"$f":"Zał.1_WPF_bazowy!F107","v":0},{"$f":"Zał.1_WPF_bazowy!G107","v":0},{"$f":"Zał.1_WPF_bazowy!H107","v":0},{"$f":"+Zał.1_WPF_bazowy!I107","v":0},{"$f":"+Zał.1_WPF_bazowy!J107","v":0},{"$f":"+Zał.1_WPF_bazowy!K107","v":0},{"$f":"+Zał.1_WPF_bazowy!L107","v":0},{"$f":"+Zał.1_WPF_bazowy!M107","v":0},{"$f":"+Zał.1_WPF_bazowy!N107","v":0},{"$f":"+Zał.1_WPF_bazowy!O107","v":0},{"$f":"+Zał.1_WPF_bazowy!P107","v":0},{"$f":"+Zał.1_WPF_bazowy!Q107","v":0},{"$f":"+Zał.1_WPF_bazowy!#REF!","v":{"$error":"#REF!"}},{"$f":"+Zał.1_WPF_bazowy!#REF!","v":{"$error":"#REF!"}},{"$f":"+Zał.1_WPF_bazowy!#REF!","v":{"$error":"#REF!"}},{"$f":"+Zał.1_WPF_bazowy!#REF!","v":{"$error":"#REF!"}},{"$f":"+Zał.1_WPF_bazowy!#REF!","v":{"$error":"#REF!"}},{"$f":"+Zał.1_WPF_bazowy!#REF!","v":{"$error":"#REF!"}},{"$f":"+Zał.1_WPF_bazowy!#REF!","v":{"$error":"#REF!"}},{"$f":"+Zał.1_WPF_bazowy!#REF!","v":{"$error":"#REF!"}},{"$f":"+Zał.1_WPF_bazowy!#REF!","v":{"$error":"#REF!"}},{"$f":"+Zał.1_WPF_bazowy!#REF!","v":{"$error":"#REF!"}},{"$f":"+Zał.1_WPF_bazowy!#REF!","v":{"$error":"#REF!"}},{"$f":"+Zał.1_WPF_bazowy!#REF!","v":{"$error":"#REF!"}},{"$f":"+Zał.1_WPF_bazowy!#REF!","v":{"$error":"#REF!"}},{"$f":"+Zał.1_WPF_bazowy!#REF!","v":{"$error":"#REF!"}},{"$f":"+Zał.1_WPF_bazowy!#REF!","v":{"$error":"#REF!"}},{"$f":"+Zał.1_WPF_bazowy!#REF!","v":{"$error":"#REF!"}},{"$f":"+Zał.1_WPF_bazowy!#REF!","v":{"$error":"#REF!"}},{"$f":"+Zał.1_WPF_bazowy!#REF!","v":{"$error":"#REF!"}},{"$f":"+Zał.1_WPF_bazowy!#REF!","v":{"$error":"#REF!"}},{"$f":"+Zał.1_WPF_bazowy!#REF!","v":{"$error":"#REF!"}},{"$f":"+Zał.1_WPF_bazowy!#REF!","v":{"$error":"#REF!"}}]
[null,16,null,"Stopień niezachowania relacji określonych w art. 242-244 ustawy \n(dotyczy tylko JST objętych procedurą z art. 240a lub 240b)","x","x","x","x","x","x","x","x","x","x","x","x","x","x","x","x","x","x","x","x","x","x","x","x","x","x","x","x","x","x","x","x","x","x"]
[null,"16.1",null,"Stopień niezachowania relacji zrównoważenia wydatków bieżących, o której mowa w poz. 8.2","x","x","x","x",{"$f":"+IF(I52<0,I52,\"\")","v":""},{"$f":"+IF(J52<0,J52,\"\")","v":""},"","","","","","","",{"$error":"#REF!"},{"$error":"#REF!"},{"$error":"#REF!"},{"$error":"#REF!"},{"$error":"#REF!"},{"$error":"#REF!"},{"$error":"#REF!"},{"$error":"#REF!"},{"$error":"#REF!"},{"$error":"#REF!"},{"$error":"#REF!"},{"$error":"#REF!"},{"$error":"#REF!"},{"$error":"#REF!"},{"$error":"#REF!"},{"$error":"#REF!"},{"$error":"#REF!"},{"$error":"#REF!"},{"$error":"#REF!"},{"$error":"#REF!"},{"$error":"#REF!"}]
["x","16.2",null,"Stopień niezachowania wskaźnika spłaty zobowiązań, o którym mowa w poz. 9.7","x","x","x","x",{"$f":"IF(I57<=I59,\"\",I59- I57)","v":""},{"$f":"IF(J57<=J59,\"\",J59- J57)","v":""},"","","","","","","",{"$error":"#REF!"},{"$error":"#REF!"},{"$error":"#REF!"},{"$error":"#REF!"},{"$error":"#REF!"},{"$error":"#REF!"},{"$error":"#REF!"},{"$error":"#REF!"},{"$error":"#REF!"},{"$error":"#REF!"},{"$error":"#REF!"},{"$error":"#REF!"},{"$error":"#REF!"},{"$error":"#REF!"},{"$error":"#REF!"},{"$error":"#REF!"},{"$error":"#REF!"},{"$error":"#REF!"},{"$error":"#REF!"},{"$error":"#REF!"},{"$error":"#REF!"}]
["x","16.3",null,"Stopień niezachowania wskaźnika spłaty zobowiązań, o którym mowa w poz. 9.7.1","x","x","x","x",{"$f":"IF(I57<=I60,\"\",I60-I57)","v":""},{"$f":"IF(J57<=J60,\"\",J60-J57)","v":""},"","","","","","","",{"$error":"#REF!"},{"$error":"#REF!"},{"$error":"#REF!"},{"$error":"#REF!"},{"$error":"#REF!"},{"$error":"#REF!"},{"$error":"#REF!"},{"$error":"#REF!"},{"$error":"#REF!"},{"$error":"#REF!"},{"$error":"#REF!"},{"$error":"#REF!"},{"$error":"#REF!"},{"$error":"#REF!"},{"$error":"#REF!"},{"$error":"#REF!"},{"$error":"#REF!"},{"$error":"#REF!"},{"$error":"#REF!"},{"$error":"#REF!"},{"$error":"#REF!"}]
[]
[]
[]
[]
[]
[null,"Weryfikacja wybranych danych wykazanych w tabeli Wieloletnia Prognoza Finansowa"]
[null,null,null,"Reguła formalna"]
[null,null,null,"Reguła rachunkowa"]
[null,null,null,"Reguła logiczna"]
[null,null,null,"Reguły kontrolne"]
[null,null,"[1.1] + [4.1] + [4.2] >= ([2.1] - [2.1.2])","Spełnienie wskaźnika z art. 242","x","x","x","x",{"$f":"IF(ROUND(I11+I33+I35,2)>=ROUND(I22-I25,2),\"TAK\",\"NIE\")","v":"TAK"},"TAK","TAK","TAK","TAK","TAK","TAK","TAK","TAK",{"$error":"#REF!"},{"$error":"#REF!"},{"$error":"#REF!"},{"$error":"#REF!"},{"$error":"#REF!"},{"$error":"#REF!"},{"$error":"#REF!"},{"$error":"#REF!"},{"$error":"#REF!"},{"$error":"#REF!"},{"$error":"#REF!"},{"$error":"#REF!"},{"$error":"#REF!"},{"$error":"#REF!"},{"$error":"#REF!"},{"$error":"#REF!"},{"$error":"#REF!"},{"$error":"#REF!"},{"$error":"#REF!"},{"$error":"#REF!"},{"$error":"#REF!"}]
[null,null,"[13.3] = 0 (dla lat 2014 i wyższych)","Umorzenie zobowiązań, o którym mowa w art. 190 ustawy o działalności leczniczej nie wykracza poza ustawowy okres","x","x","x","x","x","x",{"$f":"IF(K98=0,\"TAK\",\"BŁĄD\")","v":"TAK"},"TAK","TAK","TAK","TAK","TAK","TAK",{"$error":"#REF!"},{"$error":"#REF!"},{"$error":"#REF!"},{"$error":"#REF!"},{"$error":"#REF!"},{"$error":"#REF!"},{"$error":"#REF!"},{"$error":"#REF!"},{"$error":"#REF!"},{"$error":"#REF!"},{"$error":"#REF!"},{"$error":"#REF!"},{"$error":"#REF!"},{"$error":"#REF!"},{"$error":"#REF!"},{"$error":"#REF!"},{"$error":"#REF!"},{"$error":"#REF!"},{"$error":"#REF!"},{"$error":"#REF!"},{"$error":"#REF!"}]
[null,null,"[1] + [4] - [2] - [5] = 0","Kontrola poprawności zbilansowania budżetu","x","x","x","x",{"$f":"IF(ROUND(I10+I32-I21-I41,2)=0,\"OK\",ROUND(I10+I32-I21-I41,2))","v":"OK"},"OK","OK","OK","OK","OK","OK","OK","OK",{"$error":"#REF!"},{"$error":"#REF!"},{"$error":"#REF!"},{"$error":"#REF!"},{"$error":"#REF!"},{"$error":"#REF!"},{"$error":"#REF!"},{"$error":"#REF!"},{"$error":"#REF!"},{"$error":"#REF!"},{"$error":"#REF!"},{"$error":"#REF!"},{"$error":"#REF!"},{"$error":"#REF!"},{"$error":"#REF!"},{"$error":"#REF!"},{"$error":"#REF!"},{"$error":"#REF!"},{"$error":"#REF!"},{"$error":"#REF!"},{"$error":"#REF!"}]
[null,null,"[6]\"n\" = [6]\"n-1\" + [4.3]\"n\" - [5.1]\"n\" +  ([14.2]\"n\"-[14.2]\"n-1\") + [14.4]","Kontrola poprawności wyliczenia kwoty długu","x","x","x","x",{"$f":"+IF(ROUND(H48+I37-I42+(I105-H105)+I110-I48,2)=0,\"OK\",ROUND(H48+I37-I42+(I105-H105)+I110-I48,2))","v":"OK"},"OK","OK","OK","OK","OK","OK","OK","OK",{"$error":"#REF!"},{"$error":"#REF!"},{"$error":"#REF!"},{"$error":"#REF!"},{"$error":"#REF!"},{"$error":"#REF!"},{"$error":"#REF!"},{"$error":"#REF!"},{"$error":"#REF!"},{"$error":"#REF!"},{"$error":"#REF!"},{"$error":"#REF!"},{"$error":"#REF!"},{"$error":"#REF!"},{"$error":"#REF!"},{"$error":"#REF!"},{"$error":"#REF!"},{"$error":"#REF!"},{"$error":"#REF!"},{"$error":"#REF!"},{"$error":"#REF!"}]
[null,null,"[14.2] \"n\" =  ( [14.2]  \"n-1\" -  [14.3] \"n\" ) ","Analiza zmiany kwoty długu spłacanego wydatkami budżetu \n- wartości różne od zera wymagają objaśnienia \n   - wartości większe od zera wskazują na powstanie w roku prognozy nowego długu tego typu\n   - wartości mniejsze od zera co do zasady nie powinny wystąpić","x","x","x","x",{"$f":"+IF(H105=0,\"N/D\",IF(ROUND(I105+I106-H105,2)=0,\"OK\",ROUND(I105+I106-H105,2)))","v":"N/D"},"N/D","N/D","N/D","N/D","N/D","N/D","N/D","N/D","N/D",{"$error":"#REF!"},{"$error":"#REF!"},{"$error":"#REF!"},{"$error":"#REF!"},{"$error":"#REF!"},{"$error":"#REF!"},{"$error":"#REF!"},{"$error":"#REF!"},{"$error":"#REF!"},{"$error":"#REF!"},{"$error":"#REF!"},{"$error":"#REF!"},{"$error":"#REF!"},{"$error":"#REF!"},{"$error":"#REF!"},{"$error":"#REF!"},{"$error":"#REF!"},{"$error":"#REF!"},{"$error":"#REF!"},{"$error":"#REF!"}]
[null,null,"[13.1] \"n\"  -  ( [13.3] + [13.4] + [13.5] + [13.6] ) \"n\"  =  [13.1] \"n-1\"","Porównanie na koniec roku prognozy stanu zobowiązań przejętych przez jst po likwidowanych i przekształcanych SP ZOZ z wydatkami i umorzeniami poniesionymi na ten cel ze stanem zobowiązań z okresu N-1","x","x","x","x",{"$f":"+IF(H96=0,\"N/D\",IF(ROUND(I96+(I98+I99+I100+I101)-H96,2)=0,\"OK\",ROUND(I96+(I98+I99+I100+I101)-H96,2)))","v":"N/D"},"N/D","N/D","N/D","N/D","N/D","N/D","N/D","N/D","N/D",{"$error":"#REF!"},{"$error":"#REF!"},{"$error":"#REF!"},{"$error":"#REF!"},{"$error":"#REF!"},{"$error":"#REF!"},{"$error":"#REF!"},{"$error":"#REF!"},{"$error":"#REF!"},{"$error":"#REF!"},{"$error":"#REF!"},{"$error":"#REF!"},{"$error":"#REF!"},{"$error":"#REF!"},{"$error":"#REF!"},{"$error":"#REF!"},{"$error":"#REF!"},{"$error":"#REF!"},{"$error":"#REF!"},{"$error":"#REF!"}]
[null,null,"jeśli [3] < 0 to sprawdź czy [4.1.1] + [4.2.1] + [4.3.1] + [4.4.1] + [3] = 0","Kontrola poprawności wykazania źródeł pokrycia deficytu","x","x","x","x",{"$f":"IF(I31<0,IF(ROUND(I34+I36+I38+I40+I31,2)=0,\"OK\",ROUND(I34+I36+I38+I40+I31,2)),\"N/D\")","v":"N/D"},"N/D","N/D","N/D","N/D","N/D","N/D","N/D","N/D",{"$error":"#REF!"},{"$error":"#REF!"},{"$error":"#REF!"},{"$error":"#REF!"},{"$error":"#REF!"},{"$error":"#REF!"},{"$error":"#REF!"},{"$error":"#REF!"},{"$error":"#REF!"},{"$error":"#REF!"},{"$error":"#REF!"},{"$error":"#REF!"},{"$error":"#REF!"},{"$error":"#REF!"},{"$error":"#REF!"},{"$error":"#REF!"},{"$error":"#REF!"},{"$error":"#REF!"},{"$error":"#REF!"},{"$error":"#REF!"},{"$error":"#REF!"}]
[null,null,"jeśli [3] >= 0 to sprawdź czy [4.1.1]=0 i [4.2.1]=0 i [4.3.1]=0 i  [4.4.1] = 0","Kontrola poprawności niewykazania źródeł pokrycia deficytu przy nadwyżce budżetu","x","x","x","x",{"$f":"IF(I31>=0,IF(ROUND(I34+I36+I38+I40,2)=0,\"OK\",ROUND(I34+I36+I38+I40,2)),\"N/D\")","v":"OK"},"OK","OK","OK","OK","OK","OK","OK","OK",{"$error":"#REF!"},{"$error":"#REF!"},{"$error":"#REF!"},{"$error":"#REF!"},{"$error":"#REF!"},{"$error":"#REF!"},{"$error":"#REF!"},{"$error":"#REF!"},{"$error":"#REF!"},{"$error":"#REF!"},{"$error":"#REF!"},{"$error":"#REF!"},{"$error":"#REF!"},{"$error":"#REF!"},{"$error":"#REF!"},{"$error":"#REF!"},{"$error":"#REF!"},{"$error":"#REF!"},{"$error":"#REF!"},{"$error":"#REF!"},{"$error":"#REF!"}]
[null,null,"[1.1.3] >=  [1.1.3.1]","Reguła logiczna:  [1.1.3] >=  [1.1.3.1]","x","x","x","x",{"$f":"IF(I14>=I15,\"OK\",\"BŁĄD\")","v":"OK"},"OK","OK","OK","OK","OK","OK","OK","OK",{"$error":"#REF!"},{"$error":"#REF!"},{"$error":"#REF!"},{"$error":"#REF!"},{"$error":"#REF!"},{"$error":"#REF!"},{"$error":"#REF!"},{"$error":"#REF!"},{"$error":"#REF!"},{"$error":"#REF!"},{"$error":"#REF!"},{"$error":"#REF!"},{"$error":"#REF!"},{"$error":"#REF!"},{"$error":"#REF!"},{"$error":"#REF!"},{"$error":"#REF!"},{"$error":"#REF!"},{"$error":"#REF!"},{"$error":"#REF!"},{"$error":"#REF!"}]
[null,null,"[1.1.5] >= [13.2]","Reguła logiczna:  [1.1.5] >= [13.2]","x","x","x","x",{"$f":"IF(I17>=I97,\"OK\",\"BŁĄD\")","v":"OK"},"OK","OK","OK","OK","OK","OK","OK","OK",{"$error":"#REF!"},{"$error":"#REF!"},{"$error":"#REF!"},{"$error":"#REF!"},{"$error":"#REF!"},{"$error":"#REF!"},{"$error":"#REF!"},{"$error":"#REF!"},{"$error":"#REF!"},{"$error":"#REF!"},{"$error":"#REF!"},{"$error":"#REF!"},{"$error":"#REF!"},{"$error":"#REF!"},{"$error":"#REF!"},{"$error":"#REF!"},{"$error":"#REF!"},{"$error":"#REF!"},{"$error":"#REF!"},{"$error":"#REF!"},{"$error":"#REF!"}]
[null,null,"[1.1] >=  ([1.1.1] + [1.1.2] + [1.1.3] + [1.1.4] + [1.1.5])","Reguła logiczna:  [1.1] >=  ([1.1.1] + [1.1.2] + [1.1.3] + [1.1.4] + [1.1.5])","x","x","x","x",{"$f":"IF(I11>=I12+I13+I14+I16+I17,\"OK\",\"BŁĄD\")","v":"OK"},"OK","OK","OK","OK","OK","OK","OK","OK",{"$error":"#REF!"},{"$error":"#REF!"},{"$error":"#REF!"},{"$error":"#REF!"},{"$error":"#REF!"},{"$error":"#REF!"},{"$error":"#REF!"},{"$error":"#REF!"},{"$error":"#REF!"},{"$error":"#REF!"},{"$error":"#REF!"},{"$error":"#REF!"},{"$error":"#REF!"},{"$error":"#REF!"},{"$error":"#REF!"},{"$error":"#REF!"},{"$error":"#REF!"},{"$error":"#REF!"},{"$error":"#REF!"},{"$error":"#REF!"},{"$error":"#REF!"}]
[null,null,"[1.1] >= [12.1]","Reguła logiczna:  [1.1] >= [12.1]","x","x","x","x",{"$f":"IF(I11>=I75,\"OK\",\"BŁĄD\")","v":"OK"},"OK","OK","OK","OK","OK","OK","OK","OK",{"$error":"#REF!"},{"$error":"#REF!"},{"$error":"#REF!"},{"$error":"#REF!"},{"$error":"#REF!"},{"$error":"#REF!"},{"$error":"#REF!"},{"$error":"#REF!"},{"$error":"#REF!"},{"$error":"#REF!"},{"$error":"#REF!"},{"$error":"#REF!"},{"$error":"#REF!"},{"$error":"#REF!"},{"$error":"#REF!"},{"$error":"#REF!"},{"$error":"#REF!"},{"$error":"#REF!"},{"$error":"#REF!"},{"$error":"#REF!"},{"$error":"#REF!"}]
[null,null,"[1.2] >= [1.2.1]","Reguła logiczna:  [1.2] >= [1.2.1]","x","x","x","x",{"$f":"IF(I18>=I19,\"OK\",\"BŁĄD\")","v":"OK"},"OK","OK","OK","OK","OK","OK","OK","OK",{"$error":"#REF!"},{"$error":"#REF!"},{"$error":"#REF!"},{"$error":"#REF!"},{"$error":"#REF!"},{"$error":"#REF!"},{"$error":"#REF!"},{"$error":"#REF!"},{"$error":"#REF!"},{"$error":"#REF!"},{"$error":"#REF!"},{"$error":"#REF!"},{"$error":"#REF!"},{"$error":"#REF!"},{"$error":"#REF!"},{"$error":"#REF!"},{"$error":"#REF!"},{"$error":"#REF!"},{"$error":"#REF!"},{"$error":"#REF!"},{"$error":"#REF!"}]
[null,null,"[1.2] >= [1.2.2]","Reguła logiczna:  [1.2] >= [1.2.2]","x","x","x","x",{"$f":"IF(I18>=I20,\"OK\",\"BŁĄD\")","v":"OK"},"OK","OK","OK","OK","OK","OK","OK","OK",{"$error":"#REF!"},{"$error":"#REF!"},{"$error":"#REF!"},{"$error":"#REF!"},{"$error":"#REF!"},{"$error":"#REF!"},{"$error":"#REF!"},{"$error":"#REF!"},{"$error":"#REF!"},{"$error":"#REF!"},{"$error":"#REF!"},{"$error":"#REF!"},{"$error":"#REF!"},{"$error":"#REF!"},{"$error":"#REF!"},{"$error":"#REF!"},{"$error":"#REF!"},{"$error":"#REF!"},{"$error":"#REF!"},{"$error":"#REF!"},{"$error":"#REF!"}]
[null,null,"[1.2] >= [12.2]","Reguła logiczna:  [1.2] >= [12.2]","x","x","x","x",{"$f":"IF(I18>=I78,\"OK\",\"BŁĄD\")","v":"OK"},"OK","OK","OK","OK","OK","OK","OK","OK",{"$error":"#REF!"},{"$error":"#REF!"},{"$error":"#REF!"},{"$error":"#REF!"},{"$error":"#REF!"},{"$error":"#REF!"},{"$error":"#REF!"},{"$error":"#REF!"},{"$error":"#REF!"},{"$error":"#REF!"},{"$error":"#REF!"},{"$error":"#REF!"},{"$error":"#REF!"},{"$error":"#REF!"},{"$error":"#REF!"},{"$error":"#REF!"},{"$error":"#REF!"},{"$error":"#REF!"},{"$error":"#REF!"},{"$error":"#REF!"},{"$error":"#REF!"}]
[null,null,null,"Reguła logiczna: jeżeli [3] >0 to [10] = [3]","x","x","x","x",{"$f":"+IF(I31>0,IF(I31=I63,\"OK\",\"Błąd\"),\"N/D\")","v":"N/D"},"OK","OK","OK","OK","OK","OK","OK","OK",{"$error":"#REF!"},{"$error":"#REF!"},{"$error":"#REF!"},{"$error":"#REF!"},{"$error":"#REF!"},{"$error":"#REF!"},{"$error":"#REF!"},{"$error":"#REF!"},{"$error":"#REF!"},{"$error":"#REF!"},{"$error":"#REF!"},{"$error":"#REF!"},{"$error":"#REF!"},{"$error":"#REF!"},{"$error":"#REF!"},{"$error":"#REF!"},{"$error":"#REF!"},{"$error":"#REF!"},{"$error":"#REF!"},{"$error":"#REF!"},{"$error":"#REF!"}]
[null,null,"[10] >= [10.1]","Reguła logiczna:  [10] >= [10.1]","x","x","x","x",{"$f":"IF(I63>=I64,\"OK\",\"BŁĄD\")","v":"OK"},"OK","OK","OK","OK","OK","OK","OK","OK",{"$error":"#REF!"},{"$error":"#REF!"},{"$error":"#REF!"},{"$error":"#REF!"},{"$error":"#REF!"},{"$error":"#REF!"},{"$error":"#REF!"},{"$error":"#REF!"},{"$error":"#REF!"},{"$error":"#REF!"},{"$error":"#REF!"},{"$error":"#REF!"},{"$error":"#REF!"},{"$error":"#REF!"},{"$error":"#REF!"},{"$error":"#REF!"},{"$error":"#REF!"},{"$error":"#REF!"},{"$error":"#REF!"},{"$error":"#REF!"},{"$error":"#REF!"}]
[null,null,"jeśli [10] > 0 to powinno być [10.1] > 0","Reguła logiczna:  jeżeli [10] > 0 to [10.1] >0","x","x","x","x",{"$f":"IF(I63>0,IF(I64>0,\"OK\",\"BŁĄD\"),\"N/D\")","v":"N/D"},"OK","OK","OK","OK","OK","OK","OK","OK",{"$error":"#REF!"},{"$error":"#REF!"},{"$error":"#REF!"},{"$error":"#REF!"},{"$error":"#REF!"},{"$error":"#REF!"},{"$error":"#REF!"},{"$error":"#REF!"},{"$error":"#REF!"},{"$error":"#REF!"},{"$error":"#REF!"},{"$error":"#REF!"},{"$error":"#REF!"},{"$error":"#REF!"},{"$error":"#REF!"},{"$error":"#REF!"},{"$error":"#REF!"},{"$error":"#REF!"},{"$error":"#REF!"},{"$error":"#REF!"},{"$error":"#REF!"}]
[null,null,"[12.1] >= [12.1.1]","Reguła logiczna:  [12.1] >= [12.1.1]","x","x","x","x",{"$f":"IF(I75>=I76,\"OK\",\"BŁĄD\")","v":"OK"},"OK","OK","OK","OK","OK","OK","OK","OK",{"$error":"#REF!"},{"$error":"#REF!"},{"$error":"#REF!"},{"$error":"#REF!"},{"$error":"#REF!"},{"$error":"#REF!"},{"$error":"#REF!"},{"$error":"#REF!"},{"$error":"#REF!"},{"$error":"#REF!"},{"$error":"#REF!"},{"$error":"#REF!"},{"$error":"#REF!"},{"$error":"#REF!"},{"$error":"#REF!"},{"$error":"#REF!"},{"$error":"#REF!"},{"$error":"#REF!"},{"$error":"#REF!"},{"$error":"#REF!"},{"$error":"#REF!"}]
[null,null,"[12.1.1] >= [12.1.1.1]","Reguła logiczna:  [12.1.1] >= [12.1.1.1]","x","x","x","x",{"$f":"IF(I76>=I77,\"OK\",\"BŁĄD\")","v":"OK"},"OK","OK","OK","OK","OK","OK","OK","OK",{"$error":"#REF!"},{"$error":"#REF!"},{"$error":"#REF!"},{"$error":"#REF!"},{"$error":"#REF!"},{"$error":"#REF!"},{"$error":"#REF!"},{"$error":"#REF!"},{"$error":"#REF!"},{"$error":"#REF!"},{"$error":"#REF!"},{"$error":"#REF!"},{"$error":"#REF!"},{"$error":"#REF!"},{"$error":"#REF!"},{"$error":"#REF!"},{"$error":"#REF!"},{"$error":"#REF!"},{"$error":"#REF!"},{"$error":"#REF!"},{"$error":"#REF!"}]
[null,null,"[12.2] >= [12.2.1]","Reguła logiczna:  [12.2] >= [12.2.1]","x","x","x","x",{"$f":"IF(I78>=I79,\"OK\",\"BŁĄD\")","v":"OK"},"OK","OK","OK","OK","OK","OK","OK","OK",{"$error":"#REF!"},{"$error":"#REF!"},{"$error":"#REF!"},{"$error":"#REF!"},{"$error":"#REF!"},{"$error":"#REF!"},{"$error":"#REF!"},{"$error":"#REF!"},{"$error":"#REF!"},{"$error":"#REF!"},{"$error":"#REF!"},{"$error":"#REF!"},{"$error":"#REF!"},{"$error":"#REF!"},{"$error":"#REF!"},{"$error":"#REF!"},{"$error":"#REF!"},{"$error":"#REF!"},{"$error":"#REF!"},{"$error":"#REF!"},{"$error":"#REF!"}]
[null,null,"[12.2.1] >= [12.2.1.1]","Reguła logiczna:  [12.2.1] >= [12.2.1.1]","x","x","x","x",{"$f":"IF(I79>=I80,\"OK\",\"BŁĄD\")","v":"OK"},"OK","OK","OK","OK","OK","OK","OK","OK",{"$error":"#REF!"},{"$error":"#REF!"},{"$error":"#REF!"},{"$error":"#REF!"},{"$error":"#REF!"},{"$error":"#REF!"},{"$error":"#REF!"},{"$error":"#REF!"},{"$error":"#REF!"},{"$error":"#REF!"},{"$error":"#REF!"},{"$error":"#REF!"},{"$error":"#REF!"},{"$error":"#REF!"},{"$error":"#REF!"},{"$error":"#REF!"},{"$error":"#REF!"},{"$error":"#REF!"},{"$error":"#REF!"},{"$error":"#REF!"},{"$error":"#REF!"}]
[null,null,"[12.3] >= [12.3.1]","Reguła logiczna:  [12.3] >= [12.3.1]","x","x","x","x",{"$f":"IF(I81>=I82,\"OK\",\"BŁĄD\")","v":"OK"},"OK","OK","OK","OK","OK","OK","OK","OK",{"$error":"#REF!"},{"$error":"#REF!"},{"$error":"#REF!"},{"$error":"#REF!"},{"$error":"#REF!"},{"$error":"#REF!"},{"$error":"#REF!"},{"$error":"#REF!"},{"$error":"#REF!"},{"$error":"#REF!"},{"$error":"#REF!"},{"$error":"#REF!"},{"$error":"#REF!"},{"$error":"#REF!"},{"$error":"#REF!"},{"$error":"#REF!"},{"$error":"#REF!"},{"$error":"#REF!"},{"$error":"#REF!"},{"$error":"#REF!"},{"$error":"#REF!"}]
[null,null,"[12.3] >= [12.3.2]","Reguła logiczna:  [12.3] >= [12.3.2]","x","x","x","x",{"$f":"IF(I81>=I83,\"OK\",\"BŁĄD\")","v":"OK"},"OK","OK","OK","OK","OK","OK","OK","OK",{"$error":"#REF!"},{"$error":"#REF!"},{"$error":"#REF!"},{"$error":"#REF!"},{"$error":"#REF!"},{"$error":"#REF!"},{"$error":"#REF!"},{"$error":"#REF!"},{"$error":"#REF!"},{"$error":"#REF!"},{"$error":"#REF!"},{"$error":"#REF!"},{"$error":"#REF!"},{"$error":"#REF!"},{"$error":"#REF!"},{"$error":"#REF!"},{"$error":"#REF!"},{"$error":"#REF!"},{"$error":"#REF!"},{"$error":"#REF!"},{"$error":"#REF!"}]
[null,null,"[12.4] >= [12.4.1]","Reguła logiczna:  [12.4] >= [12.4.1]","x","x","x","x",{"$f":"IF(I84>=I85,\"OK\",\"BŁĄD\")","v":"OK"},"OK","OK","OK","OK","OK","OK","OK","OK",{"$error":"#REF!"},{"$error":"#REF!"},{"$error":"#REF!"},{"$error":"#REF!"},{"$error":"#REF!"},{"$error":"#REF!"},{"$error":"#REF!"},{"$error":"#REF!"},{"$error":"#REF!"},{"$error":"#REF!"},{"$error":"#REF!"},{"$error":"#REF!"},{"$error":"#REF!"},{"$error":"#REF!"},{"$error":"#REF!"},{"$error":"#REF!"},{"$error":"#REF!"},{"$error":"#REF!"},{"$error":"#REF!"},{"$error":"#REF!"},{"$error":"#REF!"}]
[null,null,"[12.4] >= [12.4.2]","Reguła logiczna:  [12.4] >= [12.4.2]","x","x","x","x",{"$f":"IF(I84>=I86,\"OK\",\"BŁĄD\")","v":"OK"},"OK","OK","OK","OK","OK","OK","OK","OK",{"$error":"#REF!"},{"$error":"#REF!"},{"$error":"#REF!"},{"$error":"#REF!"},{"$error":"#REF!"},{"$error":"#REF!"},{"$error":"#REF!"},{"$error":"#REF!"},{"$error":"#REF!"},{"$error":"#REF!"},{"$error":"#REF!"},{"$error":"#REF!"},{"$error":"#REF!"},{"$error":"#REF!"},{"$error":"#REF!"},{"$error":"#REF!"},{"$error":"#REF!"},{"$error":"#REF!"},{"$error":"#REF!"},{"$error":"#REF!"},{"$error":"#REF!"}]
[null,null,"[12.4] >= [12.4.1]","Reguła logiczna:  [12.5] >= [12.5.1]","x","x","x","x",{"$f":"IF(I87>=I88,\"OK\",\"BŁĄD\")","v":"OK"},{"$f":"IF(J87>=J88,\"OK\",\"BŁĄD\")","v":"OK"},"OK","OK","OK","OK","OK","OK","OK",{"$error":"#REF!"},{"$error":"#REF!"},{"$error":"#REF!"},{"$error":"#REF!"},{"$error":"#REF!"},{"$error":"#REF!"},{"$error":"#REF!"},{"$error":"#REF!"},{"$error":"#REF!"},{"$error":"#REF!"},{"$error":"#REF!"},{"$error":"#REF!"},{"$error":"#REF!"},{"$error":"#REF!"},{"$error":"#REF!"},{"$error":"#REF!"},{"$error":"#REF!"},{"$error":"#REF!"},{"$error":"#REF!"},{"$error":"#REF!"},{"$error":"#REF!"}]
[null,null,"[12.4] >= [12.4.1]","Reguła logiczna:  [12.6] >= [12.6.1]","x","x","x","x",{"$f":"IF(I89>=I90,\"OK\",\"BŁĄD\")","v":"OK"},{"$f":"IF(J89>=J90,\"OK\",\"BŁĄD\")","v":"OK"},"OK","OK","OK","OK","OK","OK","OK",{"$error":"#REF!"},{"$error":"#REF!"},{"$error":"#REF!"},{"$error":"#REF!"},{"$error":"#REF!"},{"$error":"#REF!"},{"$error":"#REF!"},{"$error":"#REF!"},{"$error":"#REF!"},{"$error":"#REF!"},{"$error":"#REF!"},{"$error":"#REF!"},{"$error":"#REF!"},{"$error":"#REF!"},{"$error":"#REF!"},{"$error":"#REF!"},{"$error":"#REF!"},{"$error":"#REF!"},{"$error":"#REF!"},{"$error":"#REF!"},{"$error":"#REF!"}]
[null,null,"[12.4] >= [12.4.1]","Reguła logiczna:  [12.7] >= [12.7.1]","x","x","x","x",{"$f":"IF(I91>=I92,\"OK\",\"BŁĄD\")","v":"OK"},{"$f":"IF(J91>=J92,\"OK\",\"BŁĄD\")","v":"OK"},"OK","OK","OK","OK","OK","OK","OK",{"$error":"#REF!"},{"$error":"#REF!"},{"$error":"#REF!"},{"$error":"#REF!"},{"$error":"#REF!"},{"$error":"#REF!"},{"$error":"#REF!"},{"$error":"#REF!"},{"$error":"#REF!"},{"$error":"#REF!"},{"$error":"#REF!"},{"$error":"#REF!"},{"$error":"#REF!"},{"$error":"#REF!"},{"$error":"#REF!"},{"$error":"#REF!"},{"$error":"#REF!"},{"$error":"#REF!"},{"$error":"#REF!"},{"$error":"#REF!"},{"$error":"#REF!"}]
[null,null,"[12.4] >= [12.4.1]","Reguła logiczna:  [12.8] >= [12.8.1]","x","x","x","x",{"$f":"IF(I93>=I94,\"OK\",\"BŁĄD\")","v":"OK"},{"$f":"IF(J93>=J94,\"OK\",\"BŁĄD\")","v":"OK"},"OK","OK","OK","OK","OK","OK","OK",{"$error":"#REF!"},{"$error":"#REF!"},{"$error":"#REF!"},{"$error":"#REF!"},{"$error":"#REF!"},{"$error":"#REF!"},{"$error":"#REF!"},{"$error":"#REF!"},{"$error":"#REF!"},{"$error":"#REF!"},{"$error":"#REF!"},{"$error":"#REF!"},{"$error":"#REF!"},{"$error":"#REF!"},{"$error":"#REF!"},{"$error":"#REF!"},{"$error":"#REF!"},{"$error":"#REF!"},{"$error":"#REF!"},{"$error":"#REF!"},{"$error":"#REF!"}]
[null,null,"[13.1] >= [13.3]","Reguła logiczna:  [13.1] >= [13.3]","x","x","x","x",{"$f":"IF(I96>=I98,\"OK\",\"BŁĄD\")","v":"OK"},"OK","OK","OK","OK","OK","OK","OK","OK",{"$error":"#REF!"},{"$error":"#REF!"},{"$error":"#REF!"},{"$error":"#REF!"},{"$error":"#REF!"},{"$error":"#REF!"},{"$error":"#REF!"},{"$error":"#REF!"},{"$error":"#REF!"},{"$error":"#REF!"},{"$error":"#REF!"},{"$error":"#REF!"},{"$error":"#REF!"},{"$error":"#REF!"},{"$error":"#REF!"},{"$error":"#REF!"},{"$error":"#REF!"},{"$error":"#REF!"},{"$error":"#REF!"},{"$error":"#REF!"},{"$error":"#REF!"}]
[null,null,"[13.4] >= [2.1.2]","Reguła logiczna:  [13.4] >= [2.1.2]","x","x","x","x",{"$f":"IF(I99>=I25,\"OK\",\"BŁĄD\")","v":"OK"},"OK","OK","OK","OK","OK","OK","OK","OK",{"$error":"#REF!"},{"$error":"#REF!"},{"$error":"#REF!"},{"$error":"#REF!"},{"$error":"#REF!"},{"$error":"#REF!"},{"$error":"#REF!"},{"$error":"#REF!"},{"$error":"#REF!"},{"$error":"#REF!"},{"$error":"#REF!"},{"$error":"#REF!"},{"$error":"#REF!"},{"$error":"#REF!"},{"$error":"#REF!"},{"$error":"#REF!"},{"$error":"#REF!"},{"$error":"#REF!"},{"$error":"#REF!"},{"$error":"#REF!"},{"$error":"#REF!"}]
[null,null,"[14.3] >= [14.3.1] + [14.3.2] + [14.3.3]","Reguła logiczna:  [14.3] >= [14.3.1] + [14.3.2] + [14.3.3]","x","x","x","x",{"$f":"IF(I106>=(I107+I108+I109),\"OK\",\"BŁĄD\")","v":"OK"},"OK","OK","OK","OK","OK","OK","OK","OK",{"$error":"#REF!"},{"$error":"#REF!"},{"$error":"#REF!"},{"$error":"#REF!"},{"$error":"#REF!"},{"$error":"#REF!"},{"$error":"#REF!"},{"$error":"#REF!"},{"$error":"#REF!"},{"$error":"#REF!"},{"$error":"#REF!"},{"$error":"#REF!"},{"$error":"#REF!"},{"$error":"#REF!"},{"$error":"#REF!"},{"$error":"#REF!"},{"$error":"#REF!"},{"$error":"#REF!"},{"$error":"#REF!"},{"$error":"#REF!"},{"$error":"#REF!"}]
[null,null,"[13.1] >= [13.3]","Reguła logiczna:  [15.1] >= [15.1.1]","x","x","x","x",{"$f":"IF(I112>=I113,\"OK\",\"BŁĄD\")","v":"OK"},{"$f":"IF(J112>=J113,\"OK\",\"BŁĄD\")","v":"OK"},"OK","OK","OK","OK","OK","OK","OK",{"$error":"#REF!"},{"$error":"#REF!"},{"$error":"#REF!"},{"$error":"#REF!"},{"$error":"#REF!"},{"$error":"#REF!"},{"$error":"#REF!"},{"$error":"#REF!"},{"$error":"#REF!"},{"$error":"#REF!"},{"$error":"#REF!"},{"$error":"#REF!"},{"$error":"#REF!"},{"$error":"#REF!"},{"$error":"#REF!"},{"$error":"#REF!"},{"$error":"#REF!"},{"$error":"#REF!"},{"$error":"#REF!"},{"$error":"#REF!"},{"$error":"#REF!"}]
[null,null,"[2.1.1] >= [2.1.1.1]","Reguła logiczna:  [2.1.1] >= [2.1.1.1]","x","x","x","x",{"$f":"IF(I23>=I24,\"OK\",\"BŁĄD\")","v":"OK"},"OK","OK","OK","OK","OK","OK","OK","OK",{"$error":"#REF!"},{"$error":"#REF!"},{"$error":"#REF!"},{"$error":"#REF!"},{"$error":"#REF!"},{"$error":"#REF!"},{"$error":"#REF!"},{"$error":"#REF!"},{"$error":"#REF!"},{"$error":"#REF!"},{"$error":"#REF!"},{"$error":"#REF!"},{"$error":"#REF!"},{"$error":"#REF!"},{"$error":"#REF!"},{"$error":"#REF!"},{"$error":"#REF!"},{"$error":"#REF!"},{"$error":"#REF!"},{"$error":"#REF!"},{"$error":"#REF!"}]
[null,null,"[2.1.1] >= [14.3.3]","Reguła logiczna:  [2.1.1] >= [14.3.3]","x","x","x","x",{"$f":"IF(I23>=I109,\"OK\",\"BŁĄD\")","v":"OK"},"OK","OK","OK","OK","OK","OK","OK","OK",{"$error":"#REF!"},{"$error":"#REF!"},{"$error":"#REF!"},{"$error":"#REF!"},{"$error":"#REF!"},{"$error":"#REF!"},{"$error":"#REF!"},{"$error":"#REF!"},{"$error":"#REF!"},{"$error":"#REF!"},{"$error":"#REF!"},{"$error":"#REF!"},{"$error":"#REF!"},{"$error":"#REF!"},{"$error":"#REF!"},{"$error":"#REF!"},{"$error":"#REF!"},{"$error":"#REF!"},{"$error":"#REF!"},{"$error":"#REF!"},{"$error":"#REF!"}]
[null,null,"[2.1.3] >= [2.1.3.1] ","Reguła logiczna:  [2.1.3] >= [2.1.3.1] ","x","x","x","x",{"$f":"IF(I26>=I27,\"OK\",\"BŁĄD\")","v":"OK"},"OK","OK","OK","OK","OK","OK","OK","OK",{"$error":"#REF!"},{"$error":"#REF!"},{"$error":"#REF!"},{"$error":"#REF!"},{"$error":"#REF!"},{"$error":"#REF!"},{"$error":"#REF!"},{"$error":"#REF!"},{"$error":"#REF!"},{"$error":"#REF!"},{"$error":"#REF!"},{"$error":"#REF!"},{"$error":"#REF!"},{"$error":"#REF!"},{"$error":"#REF!"},{"$error":"#REF!"},{"$error":"#REF!"},{"$error":"#REF!"},{"$error":"#REF!"},{"$error":"#REF!"},{"$error":"#REF!"}]
[null,null,"[2.1.3] >= [2.1.3.1] ","Reguła logiczna:  [2.1.3.1] >= [2.1.3.1.1]+[2.1.3.1.2] ","x","x","x","x",{"$f":"IF(I27>=(I28+I29),\"OK\",\"BŁĄD\")","v":"OK"},{"$f":"IF(J27>=J28,\"OK\",\"BŁĄD\")","v":"OK"},"OK","OK","OK","OK","OK","OK","OK",{"$error":"#REF!"},{"$error":"#REF!"},{"$error":"#REF!"},{"$error":"#REF!"},{"$error":"#REF!"},{"$error":"#REF!"},{"$error":"#REF!"},{"$error":"#REF!"},{"$error":"#REF!"},{"$error":"#REF!"},{"$error":"#REF!"},{"$error":"#REF!"},{"$error":"#REF!"},{"$error":"#REF!"},{"$error":"#REF!"},{"$error":"#REF!"},{"$error":"#REF!"},{"$error":"#REF!"},{"$error":"#REF!"},{"$error":"#REF!"},{"$error":"#REF!"}]
[null,null,"[2.1] >= ([2.1.1] + [2.1.2] + [2.1.3])","Reguła logiczna:  [2.1] >= ([2.1.1] + [2.1.2] + [2.1.3])","x","x","x","x",{"$f":"IF(I22>=(I23+I25+I26),\"OK\",\"BŁĄD\")","v":"OK"},"OK","OK","OK","OK","OK","OK","OK","OK",{"$error":"#REF!"},{"$error":"#REF!"},{"$error":"#REF!"},{"$error":"#REF!"},{"$error":"#REF!"},{"$error":"#REF!"},{"$error":"#REF!"},{"$error":"#REF!"},{"$error":"#REF!"},{"$error":"#REF!"},{"$error":"#REF!"},{"$error":"#REF!"},{"$error":"#REF!"},{"$error":"#REF!"},{"$error":"#REF!"},{"$error":"#REF!"},{"$error":"#REF!"},{"$error":"#REF!"},{"$error":"#REF!"},{"$error":"#REF!"},{"$error":"#REF!"}]
[null,null,"[2.1] >= [11.1]","Reguła logiczna:  [2.1] >= [11.1]","x","x","x","x",{"$f":"IF(I22>=I66,\"OK\",\"BŁĄD\")","v":"OK"},"OK","OK","OK","OK","OK","OK","OK","OK",{"$error":"#REF!"},{"$error":"#REF!"},{"$error":"#REF!"},{"$error":"#REF!"},{"$error":"#REF!"},{"$error":"#REF!"},{"$error":"#REF!"},{"$error":"#REF!"},{"$error":"#REF!"},{"$error":"#REF!"},{"$error":"#REF!"},{"$error":"#REF!"},{"$error":"#REF!"},{"$error":"#REF!"},{"$error":"#REF!"},{"$error":"#REF!"},{"$error":"#REF!"},{"$error":"#REF!"},{"$error":"#REF!"},{"$error":"#REF!"},{"$error":"#REF!"}]
[null,null,"[2.1] >= [11.3.1]","Reguła logiczna:  [2.1] >= [11.3.1]","x","x","x","x",{"$f":"IF(I22>=I69,\"OK\",\"BŁĄD\")","v":"OK"},"OK","OK","OK","OK","OK","OK","OK","OK",{"$error":"#REF!"},{"$error":"#REF!"},{"$error":"#REF!"},{"$error":"#REF!"},{"$error":"#REF!"},{"$error":"#REF!"},{"$error":"#REF!"},{"$error":"#REF!"},{"$error":"#REF!"},{"$error":"#REF!"},{"$error":"#REF!"},{"$error":"#REF!"},{"$error":"#REF!"},{"$error":"#REF!"},{"$error":"#REF!"},{"$error":"#REF!"},{"$error":"#REF!"},{"$error":"#REF!"},{"$error":"#REF!"},{"$error":"#REF!"},{"$error":"#REF!"}]
[null,null,"[2.1] >= [12.3]","Reguła logiczna:  [2.1] >= [12.3]","x","x","x","x",{"$f":"IF(I22>=I81,\"OK\",\"BŁĄD\")","v":"OK"},"OK","OK","OK","OK","OK","OK","OK","OK",{"$error":"#REF!"},{"$error":"#REF!"},{"$error":"#REF!"},{"$error":"#REF!"},{"$error":"#REF!"},{"$error":"#REF!"},{"$error":"#REF!"},{"$error":"#REF!"},{"$error":"#REF!"},{"$error":"#REF!"},{"$error":"#REF!"},{"$error":"#REF!"},{"$error":"#REF!"},{"$error":"#REF!"},{"$error":"#REF!"},{"$error":"#REF!"},{"$error":"#REF!"},{"$error":"#REF!"},{"$error":"#REF!"},{"$error":"#REF!"},{"$error":"#REF!"}]
[null,null,"[2.1] >= [13.7]","Reguła logiczna:  [2.1] >= [13.7]","x","x","x","x",{"$f":"IF(I22>=I102,\"OK\",\"BŁĄD\")","v":"OK"},"OK","OK","OK","OK","OK","OK","OK","OK",{"$error":"#REF!"},{"$error":"#REF!"},{"$error":"#REF!"},{"$error":"#REF!"},{"$error":"#REF!"},{"$error":"#REF!"},{"$error":"#REF!"},{"$error":"#REF!"},{"$error":"#REF!"},{"$error":"#REF!"},{"$error":"#REF!"},{"$error":"#REF!"},{"$error":"#REF!"},{"$error":"#REF!"},{"$error":"#REF!"},{"$error":"#REF!"},{"$error":"#REF!"},{"$error":"#REF!"},{"$error":"#REF!"},{"$error":"#REF!"},{"$error":"#REF!"}]
[null,null,"[2.2] >= [11.3.2]","Reguła logiczna:  [2.2] >= [11.3.2]","x","x","x","x",{"$f":"IF(I30>=I70,\"OK\",\"BŁĄD\")","v":"OK"},"OK","OK","OK","OK","OK","OK","OK","OK",{"$error":"#REF!"},{"$error":"#REF!"},{"$error":"#REF!"},{"$error":"#REF!"},{"$error":"#REF!"},{"$error":"#REF!"},{"$error":"#REF!"},{"$error":"#REF!"},{"$error":"#REF!"},{"$error":"#REF!"},{"$error":"#REF!"},{"$error":"#REF!"},{"$error":"#REF!"},{"$error":"#REF!"},{"$error":"#REF!"},{"$error":"#REF!"},{"$error":"#REF!"},{"$error":"#REF!"},{"$error":"#REF!"},{"$error":"#REF!"},{"$error":"#REF!"}]
[null,null,"[2.2] >= [11.4] + [11.5]","Reguła logiczna:  [2.2] >= [11.4] + [11.5]","x","x","x","x",{"$f":"IF(I30>=I71+I72,\"OK\",\"BŁĄD\")","v":"OK"},"OK","OK","OK","OK","OK","OK","OK","OK",{"$error":"#REF!"},{"$error":"#REF!"},{"$error":"#REF!"},{"$error":"#REF!"},{"$error":"#REF!"},{"$error":"#REF!"},{"$error":"#REF!"},{"$error":"#REF!"},{"$error":"#REF!"},{"$error":"#REF!"},{"$error":"#REF!"},{"$error":"#REF!"},{"$error":"#REF!"},{"$error":"#REF!"},{"$error":"#REF!"},{"$error":"#REF!"},{"$error":"#REF!"},{"$error":"#REF!"},{"$error":"#REF!"},{"$error":"#REF!"},{"$error":"#REF!"}]
[null,null,"[2.2] >= [11.6]","Reguła logiczna:  [2.2] >= [11.6]","x","x","x","x",{"$f":"IF(I30>=I73,\"OK\",\"BŁĄD\")","v":"OK"},"OK","OK","OK","OK","OK","OK","OK","OK",{"$error":"#REF!"},{"$error":"#REF!"},{"$error":"#REF!"},{"$error":"#REF!"},{"$error":"#REF!"},{"$error":"#REF!"},{"$error":"#REF!"},{"$error":"#REF!"},{"$error":"#REF!"},{"$error":"#REF!"},{"$error":"#REF!"},{"$error":"#REF!"},{"$error":"#REF!"},{"$error":"#REF!"},{"$error":"#REF!"},{"$error":"#REF!"},{"$error":"#REF!"},{"$error":"#REF!"},{"$error":"#REF!"},{"$error":"#REF!"},{"$error":"#REF!"}]
[null,null,"[2.2] >= [12.4]","Reguła logiczna:  [2.2] >= [12.4]","x","x","x","x",{"$f":"IF(I30>=I84,\"OK\",\"BŁĄD\")","v":"OK"},"OK","OK","OK","OK","OK","OK","OK","OK",{"$error":"#REF!"},{"$error":"#REF!"},{"$error":"#REF!"},{"$error":"#REF!"},{"$error":"#REF!"},{"$error":"#REF!"},{"$error":"#REF!"},{"$error":"#REF!"},{"$error":"#REF!"},{"$error":"#REF!"},{"$error":"#REF!"},{"$error":"#REF!"},{"$error":"#REF!"},{"$error":"#REF!"},{"$error":"#REF!"},{"$error":"#REF!"},{"$error":"#REF!"},{"$error":"#REF!"},{"$error":"#REF!"},{"$error":"#REF!"},{"$error":"#REF!"}]
[null,null,"[4.1] >= [4.1.1]","Reguła logiczna:  [4.1] >= [4.1.1]","x","x","x","x",{"$f":"IF(I33>=I34,\"OK\",\"BŁĄD\")","v":"OK"},"OK","OK","OK","OK","OK","OK","OK","OK",{"$error":"#REF!"},{"$error":"#REF!"},{"$error":"#REF!"},{"$error":"#REF!"},{"$error":"#REF!"},{"$error":"#REF!"},{"$error":"#REF!"},{"$error":"#REF!"},{"$error":"#REF!"},{"$error":"#REF!"},{"$error":"#REF!"},{"$error":"#REF!"},{"$error":"#REF!"},{"$error":"#REF!"},{"$error":"#REF!"},{"$error":"#REF!"},{"$error":"#REF!"},{"$error":"#REF!"},{"$error":"#REF!"},{"$error":"#REF!"},{"$error":"#REF!"}]
[null,null,"[4.2] >= [4.2.1]","Reguła logiczna:  [4.2] >= [4.2.1]","x","x","x","x",{"$f":"IF(I35>=I36,\"OK\",\"BŁĄD\")","v":"OK"},"OK","OK","OK","OK","OK","OK","OK","OK",{"$error":"#REF!"},{"$error":"#REF!"},{"$error":"#REF!"},{"$error":"#REF!"},{"$error":"#REF!"},{"$error":"#REF!"},{"$error":"#REF!"},{"$error":"#REF!"},{"$error":"#REF!"},{"$error":"#REF!"},{"$error":"#REF!"},{"$error":"#REF!"},{"$error":"#REF!"},{"$error":"#REF!"},{"$error":"#REF!"},{"$error":"#REF!"},{"$error":"#REF!"},{"$error":"#REF!"},{"$error":"#REF!"},{"$error":"#REF!"},{"$error":"#REF!"}]
[null,null,"[4.3] >= [4.3.1]","Reguła logiczna:  [4.3] >= [4.3.1]","x","x","x","x",{"$f":"IF(I37>=I38,\"OK\",\"BŁĄD\")","v":"OK"},"OK","OK","OK","OK","OK","OK","OK","OK",{"$error":"#REF!"},{"$error":"#REF!"},{"$error":"#REF!"},{"$error":"#REF!"},{"$error":"#REF!"},{"$error":"#REF!"},{"$error":"#REF!"},{"$error":"#REF!"},{"$error":"#REF!"},{"$error":"#REF!"},{"$error":"#REF!"},{"$error":"#REF!"},{"$error":"#REF!"},{"$error":"#REF!"},{"$error":"#REF!"},{"$error":"#REF!"},{"$error":"#REF!"},{"$error":"#REF!"},{"$error":"#REF!"},{"$error":"#REF!"},{"$error":"#REF!"}]
[null,null,"[4.4] >= [4.4.1]","Reguła logiczna:  [4.4] >= [4.4.1]","x","x","x","x",{"$f":"IF(I39>=I40,\"OK\",\"BŁĄD\")","v":"OK"},"OK","OK","OK","OK","OK","OK","OK","OK",{"$error":"#REF!"},{"$error":"#REF!"},{"$error":"#REF!"},{"$error":"#REF!"},{"$error":"#REF!"},{"$error":"#REF!"},{"$error":"#REF!"},{"$error":"#REF!"},{"$error":"#REF!"},{"$error":"#REF!"},{"$error":"#REF!"},{"$error":"#REF!"},{"$error":"#REF!"},{"$error":"#REF!"},{"$error":"#REF!"},{"$error":"#REF!"},{"$error":"#REF!"},{"$error":"#REF!"},{"$error":"#REF!"},{"$error":"#REF!"},{"$error":"#REF!"}]
[null,null,"[5.1] >= [5.1.1]","Reguła logiczna:  [5.1] >= [5.1.1]","x","x","x","x",{"$f":"IF(I42>=I43,\"OK\",\"BŁĄD\")","v":"OK"},"OK","OK","OK","OK","OK","OK","OK","OK",{"$error":"#REF!"},{"$error":"#REF!"},{"$error":"#REF!"},{"$error":"#REF!"},{"$error":"#REF!"},{"$error":"#REF!"},{"$error":"#REF!"},{"$error":"#REF!"},{"$error":"#REF!"},{"$error":"#REF!"},{"$error":"#REF!"},{"$error":"#REF!"},{"$error":"#REF!"},{"$error":"#REF!"},{"$error":"#REF!"},{"$error":"#REF!"},{"$error":"#REF!"},{"$error":"#REF!"},{"$error":"#REF!"},{"$error":"#REF!"},{"$error":"#REF!"}]
[null,null,"[5.1] >= [10.1]","Reguła logiczna:  [5.1] >= [10.1]","x","x","x","x",{"$f":"IF(I42>=I64,\"OK\",\"BŁĄD\")","v":"OK"},"OK","OK","OK","OK","OK","OK","OK","OK",{"$error":"#REF!"},{"$error":"#REF!"},{"$error":"#REF!"},{"$error":"#REF!"},{"$error":"#REF!"},{"$error":"#REF!"},{"$error":"#REF!"},{"$error":"#REF!"},{"$error":"#REF!"},{"$error":"#REF!"},{"$error":"#REF!"},{"$error":"#REF!"},{"$error":"#REF!"},{"$error":"#REF!"},{"$error":"#REF!"},{"$error":"#REF!"},{"$error":"#REF!"},{"$error":"#REF!"},{"$error":"#REF!"},{"$error":"#REF!"},{"$error":"#REF!"}]
[null,null,"[5.1] >= [14.1]","Reguła logiczna:  [5.1] >= [14.1]","x","x","x","x",{"$f":"IF(I42>=I104,\"OK\",\"BŁĄD\")","v":"OK"},"OK","OK","OK","OK","OK","OK","OK","OK",{"$error":"#REF!"},{"$error":"#REF!"},{"$error":"#REF!"},{"$error":"#REF!"},{"$error":"#REF!"},{"$error":"#REF!"},{"$error":"#REF!"},{"$error":"#REF!"},{"$error":"#REF!"},{"$error":"#REF!"},{"$error":"#REF!"},{"$error":"#REF!"},{"$error":"#REF!"},{"$error":"#REF!"},{"$error":"#REF!"},{"$error":"#REF!"},{"$error":"#REF!"},{"$error":"#REF!"},{"$error":"#REF!"},{"$error":"#REF!"},{"$error":"#REF!"}]
[null,null,"[6] >=[7]","Reguła logiczna:  [6] >=[7]","x","x","x","x",{"$f":"IF(I48>=I49,\"OK\",\"BŁĄD\")","v":"OK"},"OK","OK","OK","OK","OK","OK","OK","OK",{"$error":"#REF!"},{"$error":"#REF!"},{"$error":"#REF!"},{"$error":"#REF!"},{"$error":"#REF!"},{"$error":"#REF!"},{"$error":"#REF!"},{"$error":"#REF!"},{"$error":"#REF!"},{"$error":"#REF!"},{"$error":"#REF!"},{"$error":"#REF!"},{"$error":"#REF!"},{"$error":"#REF!"},{"$error":"#REF!"},{"$error":"#REF!"},{"$error":"#REF!"},{"$error":"#REF!"},{"$error":"#REF!"},{"$error":"#REF!"},{"$error":"#REF!"}]
[null,null,"[6] >= [14.2]","Reguła logiczna:  [6] >= [14.2]","x","x","x","x",{"$f":"IF(I48>=I105,\"OK\",\"BŁĄD\")","v":"OK"},"OK","OK","OK","OK","OK","OK","OK","OK",{"$error":"#REF!"},{"$error":"#REF!"},{"$error":"#REF!"},{"$error":"#REF!"},{"$error":"#REF!"},{"$error":"#REF!"},{"$error":"#REF!"},{"$error":"#REF!"},{"$error":"#REF!"},{"$error":"#REF!"},{"$error":"#REF!"},{"$error":"#REF!"},{"$error":"#REF!"},{"$error":"#REF!"},{"$error":"#REF!"},{"$error":"#REF!"},{"$error":"#REF!"},{"$error":"#REF!"},{"$error":"#REF!"},{"$error":"#REF!"},{"$error":"#REF!"}]
[null,null,"7>=13.1","Reguła logiczna:  7>=13.1","x","x","x","x",{"$f":"IF(I49>=I96,\"OK\",\"BŁĄD\")","v":"OK"},"OK","OK","OK","OK","OK","OK","OK","OK",{"$error":"#REF!"},{"$error":"#REF!"},{"$error":"#REF!"},{"$error":"#REF!"},{"$error":"#REF!"},{"$error":"#REF!"},{"$error":"#REF!"},{"$error":"#REF!"},{"$error":"#REF!"},{"$error":"#REF!"},{"$error":"#REF!"},{"$error":"#REF!"},{"$error":"#REF!"},{"$error":"#REF!"},{"$error":"#REF!"},{"$error":"#REF!"},{"$error":"#REF!"},{"$error":"#REF!"},{"$error":"#REF!"},{"$error":"#REF!"},{"$error":"#REF!"}]
[null,null,"jeżeli [2.1.3] <> 0 to  [2.1.3.1] <> 0 ","Reguła logiczna:  jeżeli [2.1.3] <> 0 to  [2.1.3.1] <> 0 ","x","x","x","x",{"$f":"IF(I26<>0,IF(I27<>0,\"OK\",\"BŁĄD\"),\"N/D\")","v":"OK"},"OK","OK","OK","OK","OK","OK","OK","OK",{"$error":"#REF!"},{"$error":"#REF!"},{"$error":"#REF!"},{"$error":"#REF!"},{"$error":"#REF!"},{"$error":"#REF!"},{"$error":"#REF!"},{"$error":"#REF!"},{"$error":"#REF!"},{"$error":"#REF!"},{"$error":"#REF!"},{"$error":"#REF!"},{"$error":"#REF!"},{"$error":"#REF!"},{"$error":"#REF!"},{"$error":"#REF!"},{"$error":"#REF!"},{"$error":"#REF!"},{"$error":"#REF!"},{"$error":"#REF!"},{"$error":"#REF!"}]
[]
[null,null,null,"Kontrola poprawności podstawowych kwot"]
[null,null,null,"Dochody ogółem = bieżące + majątkowe",{"$f":"E11+E18","v":36897999.469999999},38775186.080000006,36552514.890000001,36552514.890000001,32174588,33100000,34100000,35100000,36100000,37100000,38100000,39100000,40100000,{"$error":"#REF!"},{"$error":"#REF!"},{"$error":"#REF!"},{"$error":"#REF!"},{"$error":"#REF!"},{"$error":"#REF!"},{"$error":"#REF!"},{"$error":"#REF!"},{"$error":"#REF!"},{"$error":"#REF!"},{"$error":"#REF!"},{"$error":"#REF!"},{"$error":"#REF!"},{"$error":"#REF!"},{"$error":"#REF!"},{"$error":"#REF!"},{"$error":"#REF!"},{"$error":"#REF!"},{"$error":"#REF!"},{"$error":"#REF!"},{"$error":"#REF!"}]
[null,null,null,"Wydatki ogółem = bieżące + majątkowe",{"$f":"E22+E30","v":37003938.299999997},37365699.93,42482913.269999996,42482913.269999996,32174588,31621796,32421796,33239996,33889996,34889996,35849996,36682000,36681616,{"$error":"#REF!"},{"$error":"#REF!"},{"$error":"#REF!"},{"$error":"#REF!"},{"$error":"#REF!"},{"$error":"#REF!"},{"$error":"#REF!"},{"$error":"#REF!"},{"$error":"#REF!"},{"$error":"#REF!"},{"$error":"#REF!"},{"$error":"#REF!"},{"$error":"#REF!"},{"$error":"#REF!"},{"$error":"#REF!"},{"$error":"#REF!"},{"$error":"#REF!"},{"$error":"#REF!"},{"$error":"#REF!"},{"$error":"#REF!"},{"$error":"#REF!"}]
[null,null,null,"Wynik budżetu = dochody ogółem - wydatki ogółem",{"$f":"E10-E21","v":-105938.82999999821},1409486.1499999985,-5930398.3800000027,-5930398.3799999952,0,1478204,1678204,1860004,2210004,2210004,2250004,2418000,3418384,{"$error":"#REF!"},{"$error":"#REF!"},{"$error":"#REF!"},{"$error":"#REF!"},{"$error":"#REF!"},{"$error":"#REF!"},{"$error":"#REF!"},{"$error":"#REF!"},{"$error":"#REF!"},{"$error":"#REF!"},{"$error":"#REF!"},{"$error":"#REF!"},{"$error":"#REF!"},{"$error":"#REF!"},{"$error":"#REF!"},{"$error":"#REF!"},{"$error":"#REF!"},{"$error":"#REF!"},{"$error":"#REF!"},{"$error":"#REF!"},{"$error":"#REF!"}]
[null,null,null,"Wyliczenie kwoty długu","x",{"$f":"E48+F37-F42+(F105-E105)+F110","v":15984842.880000001},"x",{"$f":"F48+H37-H42+(H105-F105)+H110","v":17522808},{"$f":"H48+I37-I42+(I105-H105)+I110","v":17522808},16044604,14366400,12506396,10296392,8086388,5836384,3418384,0,{"$error":"#REF!"},{"$error":"#REF!"},{"$error":"#REF!"},{"$error":"#REF!"},{"$error":"#REF!"},{"$error":"#REF!"},{"$error":"#REF!"},{"$error":"#REF!"},{"$error":"#REF!"},{"$error":"#REF!"},{"$error":"#REF!"},{"$error":"#REF!"},{"$error":"#REF!"},{"$error":"#REF!"},{"$error":"#REF!"},{"$error":"#REF!"},{"$error":"#REF!"},{"$error":"#REF!"},{"$error":"#REF!"},{"$error":"#REF!"},{"$error":"#REF!"}]
[null,null,null,"Wyliczenie zobowiązań wynikających z przejęcia przez jst zobowiązań po likwidowanych i przekształcanych SZOZ","x",{"$f":"E96-(F98+F99+F100+F101)","v":0},"x",{"$f":"F96-(H98+H99+H100+H101)","v":0},{"$f":"H96-(I98+I99+I100+I101)","v":0},0,0,0,0,0,0,0,0,{"$error":"#REF!"},{"$error":"#REF!"},{"$error":"#REF!"},{"$error":"#REF!"},{"$error":"#REF!"},{"$error":"#REF!"},{"$error":"#REF!"},{"$error":"#REF!"},{"$error":"#REF!"},{"$error":"#REF!"},{"$error":"#REF!"},{"$error":"#REF!"},{"$error":"#REF!"},{"$error":"#REF!"},{"$error":"#REF!"},{"$error":"#REF!"},{"$error":"#REF!"},{"$error":"#REF!"},{"$error":"#REF!"},{"$error":"#REF!"},{"$error":"#REF!"}]
[]
[null,null,null,"Analiza ryzyka niespełnienia wskaźnika z art. 243"]
[null,null,null,"Analiza składowych wzoru wskaźnika z art. 243"]
[null,null,null,0,{"$f":"+\"różnica mniejsza od \"&TEXT(D197*100,\"0,0\")&\"%\"","v":"różnica mniejsza od 0,0%"}]
[null,null,null,5.0000000000000001E-3,{"$f":"+\"różnica mniejsza od \"&TEXT(D198*100,\"0,0\")&\"%\"","v":"różnica mniejsza od 0,5%"}]
[null,null,null,0.01,{"$f":"+\"różnica mniejsza od \"&TEXT(D199*100,\"0,0\")&\"%\"","v":"różnica mniejsza od 1,0%"}]
[null,null,null,"max. limit spłat (planistyczny) - (R+O)/D (bez wyłączeń)","x","x","x","x",{"$f":"+IF(I10=0,\"\",I59-I54)","v":6.9666666666666627E-3},3.96666666666666E-3,3.6333333333333356E-3,1.7933333333333329E-2,2.4466666666666664E-2,3.9999999999999994E-2,5.389999999999999E-2,6.3499999999999987E-2,5.2166666666666653E-2,{"$error":"#REF!"},{"$error":"#REF!"},{"$error":"#REF!"},{"$error":"#REF!"},{"$error":"#REF!"},{"$error":"#REF!"},{"$error":"#REF!"},{"$error":"#REF!"},{"$error":"#REF!"},{"$error":"#REF!"},{"$error":"#REF!"},{"$error":"#REF!"},{"$error":"#REF!"},{"$error":"#REF!"},{"$error":"#REF!"},{"$error":"#REF!"},{"$error":"#REF!"},{"$error":"#REF!"},{"$error":"#REF!"},{"$error":"#REF!"},{"$error":"#REF!"}]
[null,null,null,"max. limit spłat (planistyczny) - (R+O)/D (z wyłączeniami)","x","x","x","x",{"$f":"+IF(I10=0,\"\",I59-I55)","v":6.9666666666666627E-3},3.96666666666666E-3,3.6333333333333356E-3,1.7933333333333329E-2,2.4466666666666664E-2,3.9999999999999994E-2,5.389999999999999E-2,6.3499999999999987E-2,5.2166666666666653E-2,{"$error":"#REF!"},{"$error":"#REF!"},{"$error":"#REF!"},{"$error":"#REF!"},{"$error":"#REF!"},{"$error":"#REF!"},{"$error":"#REF!"},{"$error":"#REF!"},{"$error":"#REF!"},{"$error":"#REF!"},{"$error":"#REF!"},{"$error":"#REF!"},{"$error":"#REF!"},{"$error":"#REF!"},{"$error":"#REF!"},{"$error":"#REF!"},{"$error":"#REF!"},{"$error":"#REF!"},{"$error":"#REF!"},{"$error":"#REF!"},{"$error":"#REF!"}]
[null,null,null,"max. limit spłat (wg wykonania) - (R+O)/D (bez wyłączeń)","x","x","x","x",{"$f":"+IF(I10=0,\"\",I60-I54)","v":6.9999999999999923E-3},3.9999999999999897E-3,3.600000000000006E-3,1.7899999999999999E-2,2.4500000000000008E-2,3.9999999999999994E-2,5.3900000000000003E-2,6.3499999999999987E-2,5.220000000000001E-2,{"$error":"#REF!"},{"$error":"#REF!"},{"$error":"#REF!"},{"$error":"#REF!"},{"$error":"#REF!"},{"$error":"#REF!"},{"$error":"#REF!"},{"$error":"#REF!"},{"$error":"#REF!"},{"$error":"#REF!"},{"$error":"#REF!"},{"$error":"#REF!"},{"$error":"#REF!"},{"$error":"#REF!"},{"$error":"#REF!"},{"$error":"#REF!"},{"$error":"#REF!"},{"$error":"#REF!"},{"$error":"#REF!"},{"$error":"#REF!"},{"$error":"#REF!"}]
[null,null,null,"max. limit spłat (wg wykonania) - (R+O)/D (z wyłączeniami)","x","x","x","x",{"$f":"+IF(I10=0,\"\",I60-I55)","v":6.9999999999999923E-3},3.9999999999999897E-3,3.600000000000006E-3,1.7899999999999999E-2,2.4500000000000008E-2,3.9999999999999994E-2,5.3900000000000003E-2,6.3499999999999987E-2,5.220000000000001E-2,{"$error":"#REF!"},{"$error":"#REF!"},{"$error":"#REF!"},{"$error":"#REF!"},{"$error":"#REF!"},{"$error":"#REF!"},{"$error":"#REF!"},{"$error":"#REF!"},{"$error":"#REF!"},{"$error":"#REF!"},{"$error":"#REF!"},{"$error":"#REF!"},{"$error":"#REF!"},{"$error":"#REF!"},{"$error":"#REF!"},{"$error":"#REF!"},{"$error":"#REF!"},{"$error":"#REF!"},{"$error":"#REF!"},{"$error":"#REF!"},{"$error":"#REF!"}]

{"sheet":"definicja","index":2,"n_rows":114,"n_cols":34,"rows_kept":114,"cut":false,"hidden":true,"merged":[]}
[]
[null,null,"dane z eWPF"]
[null,null,"dane z Rb"]
[]
[]
[]
[]
[]
[null,"Lp.","Wyszczególnienie",0,0,{"$f":"+E9+1","v":1},{"$f":"+F9+1","v":2},3,4,5,6,7,8,9,10,{"$f":"+O9+1","v":11},12,13,14,15,16,17,18,19,20,21,22,23,24,25,26,27,{"$f":"+AF9+1","v":28},{"$f":"+AG9+1","v":29}]
[10,1,"Dochody ogółem",{"$f":"+\"rokwzgl=\"&D$9&\" i lp=\"&$A10","v":"rokwzgl=0 i lp=10"},"rokwzgl=0 i lp=10","rokwzgl=1 i lp=10","rokwzgl=2 i lp=10","rokwzgl=3 i lp=10","rokwzgl=4 i lp=10","rokwzgl=5 i lp=10","rokwzgl=6 i lp=10","rokwzgl=7 i lp=10","rokwzgl=8 i lp=10",{"$f":"+\"rokwzgl=\"&N$9&\" i lp=\"&$A10","v":"rokwzgl=9 i lp=10"},"rokwzgl=10 i lp=10","rokwzgl=11 i lp=10","rokwzgl=12 i lp=10","rokwzgl=13 i lp=10","rokwzgl=14 i lp=10","rokwzgl=15 i lp=10","rokwzgl=16 i lp=10","rokwzgl=17 i lp=10","rokwzgl=18 i lp=10",{"$f":"+\"rokwzgl=\"&X$9&\" i lp=\"&$A10","v":"rokwzgl=19 i lp=10"},"rokwzgl=20 i lp=10","rokwzgl=21 i lp=10","rokwzgl=22 i lp=10","rokwzgl=23 i lp=10","rokwzgl=24 i lp=10","rokwzgl=25 i lp=10","rokwzgl=26 i lp=10","rokwzgl=27 i lp=10","rokwzgl=28 i lp=10","rokwzgl=29 i lp=10"]
[20,"1.1"," Dochody bieżące","rokwzgl=0 i lp=20","rokwzgl=0 i lp=20","rokwzgl=1 i lp=20","rokwzgl=2 i lp=20","rokwzgl=3 i lp=20","rokwzgl=4 i lp=20","rokwzgl=5 i lp=20","rokwzgl=6 i lp=20","rokwzgl=7 i lp=20","rokwzgl=8 i lp=20","rokwzgl=9 i lp=20","rokwzgl=10 i lp=20","rokwzgl=11 i lp=20","rokwzgl=12 i lp=20","rokwzgl=13 i lp=20","rokwzgl=14 i lp=20","rokwzgl=15 i lp=20","rokwzgl=16 i lp=20","rokwzgl=17 i lp=20","rokwzgl=18 i lp=20","rokwzgl=19 i lp=20","rokwzgl=20 i lp=20","rokwzgl=21 i lp=20","rokwzgl=22 i lp=20","rokwzgl=23 i lp=20","rokwzgl=24 i lp=20","rokwzgl=25 i lp=20","rokwzgl=26 i lp=20","rokwzgl=27 i lp=20","rokwzgl=28 i lp=20","rokwzgl=29 i lp=20"]
[30,"1.1.1","  dochody z tytułu udziału we wpływach z podatku dochodowego od osób fizycznych","rokwzgl=0 i lp=30","rokwzgl=0 i lp=30","rokwzgl=1 i lp=30","rokwzgl=2 i lp=30","rokwzgl=3 i lp=30","rokwzgl=4 i lp=30","rokwzgl=5 i lp=30","rokwzgl=6 i lp=30","rokwzgl=7 i lp=30","rokwzgl=8 i lp=30","rokwzgl=9 i lp=30","rokwzgl=10 i lp=30","rokwzgl=11 i lp=30","rokwzgl=12 i lp=30","rokwzgl=13 i lp=30","rokwzgl=14 i lp=30","rokwzgl=15 i lp=30","rokwzgl=16 i lp=30","rokwzgl=17 i lp=30","rokwzgl=18 i lp=30","rokwzgl=19 i lp=30","rokwzgl=20 i lp=30","rokwzgl=21 i lp=30","rokwzgl=22 i lp=30","rokwzgl=23 i lp=30","rokwzgl=24 i lp=30","rokwzgl=25 i lp=30","rokwzgl=26 i lp=30","rokwzgl=27 i lp=30","rokwzgl=28 i lp=30","rokwzgl=29 i lp=30"]
[40,"1.1.2","  dochody z tytułu udziału we wpływach z podatku dochodowego od osób prawnych","rokwzgl=0 i lp=40","rokwzgl=0 i lp=40","rokwzgl=1 i lp=40","rokwzgl=2 i lp=40","rokwzgl=3 i lp=40","rokwzgl=4 i lp=40","rokwzgl=5 i lp=40","rokwzgl=6 i lp=40","rokwzgl=7 i lp=40","rokwzgl=8 i lp=40","rokwzgl=9 i lp=40","rokwzgl=10 i lp=40","rokwzgl=11 i lp=40","rokwzgl=12 i lp=40","rokwzgl=13 i lp=40","rokwzgl=14 i lp=40","rokwzgl=15 i lp=40","rokwzgl=16 i lp=40","rokwzgl=17 i lp=40","rokwzgl=18 i lp=40","rokwzgl=19 i lp=40","rokwzgl=20 i lp=40","rokwzgl=21 i lp=40","rokwzgl=22 i lp=40","rokwzgl=23 i lp=40","rokwzgl=24 i lp=40","rokwzgl=25 i lp=40","rokwzgl=26 i lp=40","rokwzgl=27 i lp=40","rokwzgl=28 i lp=40","rokwzgl=29 i lp=40"]
[50,"1.1.3","  podatki i opłaty","rokwzgl=0 i lp=50","rokwzgl=0 i lp=50","rokwzgl=1 i lp=50","rokwzgl=2 i lp=50","rokwzgl=3 i lp=50","rokwzgl=4 i lp=50","rokwzgl=5 i lp=50","rokwzgl=6 i lp=50","rokwzgl=7 i lp=50","rokwzgl=8 i lp=50","rokwzgl=9 i lp=50","rokwzgl=10 i lp=50","rokwzgl=11 i lp=50","rokwzgl=12 i lp=50","rokwzgl=13 i lp=50","rokwzgl=14 i lp=50","rokwzgl=15 i lp=50","rokwzgl=16 i lp=50","rokwzgl=17 i lp=50","rokwzgl=18 i lp=50","rokwzgl=19 i lp=50","rokwzgl=20 i lp=50","rokwzgl=21 i lp=50","rokwzgl=22 i lp=50","rokwzgl=23 i lp=50","rokwzgl=24 i lp=50","rokwzgl=25 i lp=50","rokwzgl=26 i lp=50","rokwzgl=27 i lp=50","rokwzgl=28 i lp=50","rokwzgl=29 i lp=50"]
[60,"1.1.3.1","   z podatku od nieruchomości","rokwzgl=0 i lp=60","rokwzgl=0 i lp=60","rokwzgl=1 i lp=60","rokwzgl=2 i lp=60","rokwzgl=3 i lp=60","rokwzgl=4 i lp=60","rokwzgl=5 i lp=60","rokwzgl=6 i lp=60","rokwzgl=7 i lp=60","rokwzgl=8 i lp=60","rokwzgl=9 i lp=60","rokwzgl=10 i lp=60","rokwzgl=11 i lp=60","rokwzgl=12 i lp=60","rokwzgl=13 i lp=60","rokwzgl=14 i lp=60","rokwzgl=15 i lp=60","rokwzgl=16 i lp=60","rokwzgl=17 i lp=60","rokwzgl=18 i lp=60","rokwzgl=19 i lp=60","rokwzgl=20 i lp=60","rokwzgl=21 i lp=60","rokwzgl=22 i lp=60","rokwzgl=23 i lp=60","rokwzgl=24 i lp=60","rokwzgl=25 i lp=60","rokwzgl=26 i lp=60","rokwzgl=27 i lp=60","rokwzgl=28 i lp=60","rokwzgl=29 i lp=60"]
[70,"1.1.4","  z subwencji ogólnej","rokwzgl=0 i lp=70","rokwzgl=0 i lp=70","rokwzgl=1 i lp=70","rokwzgl=2 i lp=70","rokwzgl=3 i lp=70","rokwzgl=4 i lp=70","rokwzgl=5 i lp=70","rokwzgl=6 i lp=70","rokwzgl=7 i lp=70","rokwzgl=8 i lp=70","rokwzgl=9 i lp=70","rokwzgl=10 i lp=70","rokwzgl=11 i lp=70","rokwzgl=12 i lp=70","rokwzgl=13 i lp=70","rokwzgl=14 i lp=70","rokwzgl=15 i lp=70","rokwzgl=16 i lp=70","rokwzgl=17 i lp=70","rokwzgl=18 i lp=70","rokwzgl=19 i lp=70","rokwzgl=20 i lp=70","rokwzgl=21 i lp=70","rokwzgl=22 i lp=70","rokwzgl=23 i lp=70","rokwzgl=24 i lp=70","rokwzgl=25 i lp=70","rokwzgl=26 i lp=70","rokwzgl=27 i lp=70","rokwzgl=28 i lp=70","rokwzgl=29 i lp=70"]
[80,"1.1.5","  z tytułu dotacji i środków przeznaczonych na cele bieżące","rokwzgl=0 i lp=80","rokwzgl=0 i lp=80","rokwzgl=1 i lp=80","rokwzgl=2 i lp=80","rokwzgl=3 i lp=80","rokwzgl=4 i lp=80","rokwzgl=5 i lp=80","rokwzgl=6 i lp=80","rokwzgl=7 i lp=80","rokwzgl=8 i lp=80","rokwzgl=9 i lp=80","rokwzgl=10 i lp=80","rokwzgl=11 i lp=80","rokwzgl=12 i lp=80","rokwzgl=13 i lp=80","rokwzgl=14 i lp=80","rokwzgl=15 i lp=80","rokwzgl=16 i lp=80","rokwzgl=17 i lp=80","rokwzgl=18 i lp=80","rokwzgl=19 i lp=80","rokwzgl=20 i lp=80","rokwzgl=21 i lp=80","rokwzgl=22 i lp=80","rokwzgl=23 i lp=80","rokwzgl=24 i lp=80","rokwzgl=25 i lp=80","rokwzgl=26 i lp=80","rokwzgl=27 i lp=80","rokwzgl=28 i lp=80","rokwzgl=29 i lp=80"]
[90,"1.2","  Dochody majątkowe, w tym","rokwzgl=0 i lp=90","rokwzgl=0 i lp=90","rokwzgl=1 i lp=90","rokwzgl=2 i lp=90","rokwzgl=3 i lp=90","rokwzgl=4 i lp=90","rokwzgl=5 i lp=90","rokwzgl=6 i lp=90","rokwzgl=7 i lp=90","rokwzgl=8 i lp=90","rokwzgl=9 i lp=90","rokwzgl=10 i lp=90","rokwzgl=11 i lp=90","rokwzgl=12 i lp=90","rokwzgl=13 i lp=90","rokwzgl=14 i lp=90","rokwzgl=15 i lp=90","rokwzgl=16 i lp=90","rokwzgl=17 i lp=90","rokwzgl=18 i lp=90","rokwzgl=19 i lp=90","rokwzgl=20 i lp=90","rokwzgl=21 i lp=90","rokwzgl=22 i lp=90","rokwzgl=23 i lp=90","rokwzgl=24 i lp=90","rokwzgl=25 i lp=90","rokwzgl=26 i lp=90","rokwzgl=27 i lp=90","rokwzgl=28 i lp=90","rokwzgl=29 i lp=90"]
[100,"1.2.1","  ze sprzedaży majątku","rokwzgl=0 i lp=100","rokwzgl=0 i lp=100","rokwzgl=1 i lp=100","rokwzgl=2 i lp=100","rokwzgl=3 i lp=100","rokwzgl=4 i lp=100","rokwzgl=5 i lp=100","rokwzgl=6 i lp=100","rokwzgl=7 i lp=100","rokwzgl=8 i lp=100","rokwzgl=9 i lp=100","rokwzgl=10 i lp=100","rokwzgl=11 i lp=100","rokwzgl=12 i lp=100","rokwzgl=13 i lp=100","rokwzgl=14 i lp=100","rokwzgl=15 i lp=100","rokwzgl=16 i lp=100","rokwzgl=17 i lp=100","rokwzgl=18 i lp=100","rokwzgl=19 i lp=100","rokwzgl=20 i lp=100","rokwzgl=21 i lp=100","rokwzgl=22 i lp=100","rokwzgl=23 i lp=100","rokwzgl=24 i lp=100","rokwzgl=25 i lp=100","rokwzgl=26 i lp=100","rokwzgl=27 i lp=100","rokwzgl=28 i lp=100","rokwzgl=29 i lp=100"]
[110,"1.2.2","  z tytułu dotacji oraz środków przeznaczonych na inwestycje",{"$f":"+\"rokwzgl=\"&D$9&\" i lp=\"&$A20","v":"rokwzgl=0 i lp=110"},"rokwzgl=0 i lp=110","rokwzgl=1 i lp=110","rokwzgl=2 i lp=110","rokwzgl=3 i lp=110","rokwzgl=4 i lp=110","rokwzgl=5 i lp=110","rokwzgl=6 i lp=110","rokwzgl=7 i lp=110","rokwzgl=8 i lp=110",{"$f":"+\"rokwzgl=\"&N$9&\" i lp=\"&$A20","v":"rokwzgl=9 i lp=110"},"rokwzgl=10 i lp=110","rokwzgl=11 i lp=110","rokwzgl=12 i lp=110","rokwzgl=13 i lp=110","rokwzgl=14 i lp=110","rokwzgl=15 i lp=110","rokwzgl=16 i lp=110","rokwzgl=17 i lp=110","rokwzgl=18 i lp=110",{"$f":"+\"rokwzgl=\"&X$9&\" i lp=\"&$A20","v":"rokwzgl=19 i lp=110"},"rokwzgl=20 i lp=110","rokwzgl=21 i lp=110","rokwzgl=22 i lp=110","rokwzgl=23 i lp=110","rokwzgl=24 i lp=110","rokwzgl=25 i lp=110","rokwzgl=26 i lp=110","rokwzgl=27 i lp=110","rokwzgl=28 i lp=110","rokwzgl=29 i lp=110"]
[120,2,"Wydatki ogółem","rokwzgl=0 i lp=120","rokwzgl=0 i lp=120","rokwzgl=1 i lp=120","rokwzgl=2 i lp=120","rokwzgl=3 i lp=120","rokwzgl=4 i lp=120","rokwzgl=5 i lp=120","rokwzgl=6 i lp=120","rokwzgl=7 i lp=120","rokwzgl=8 i lp=120","rokwzgl=9 i lp=120","rokwzgl=10 i lp=120","rokwzgl=11 i lp=120","rokwzgl=12 i lp=120","rokwzgl=13 i lp=120","rokwzgl=14 i lp=120","rokwzgl=15 i lp=120","rokwzgl=16 i lp=120","rokwzgl=17 i lp=120","rokwzgl=18 i lp=120","rokwzgl=19 i lp=120","rokwzgl=20 i lp=120","rokwzgl=21 i lp=120","rokwzgl=22 i lp=120","rokwzgl=23 i lp=120","rokwzgl=24 i lp=120","rokwzgl=25 i lp=120","rokwzgl=26 i lp=120","rokwzgl=27 i lp=120","rokwzgl=28 i lp=120","rokwzgl=29 i lp=120"]
[130,"2.1"," Wydatki bieżące, w tym:","rokwzgl=0 i lp=130","rokwzgl=0 i lp=130","rokwzgl=1 i lp=130","rokwzgl=2 i lp=130","rokwzgl=3 i lp=130","rokwzgl=4 i lp=130","rokwzgl=5 i lp=130","rokwzgl=6 i lp=130","rokwzgl=7 i lp=130","rokwzgl=8 i lp=130","rokwzgl=9 i lp=130","rokwzgl=10 i lp=130","rokwzgl=11 i lp=130","rokwzgl=12 i lp=130","rokwzgl=13 i lp=130","rokwzgl=14 i lp=130","rokwzgl=15 i lp=130","rokwzgl=16 i lp=130","rokwzgl=17 i lp=130","rokwzgl=18 i lp=130","rokwzgl=19 i lp=130","rokwzgl=20 i lp=130","rokwzgl=21 i lp=130","rokwzgl=22 i lp=130","rokwzgl=23 i lp=130","rokwzgl=24 i lp=130","rokwzgl=25 i lp=130","rokwzgl=26 i lp=130","rokwzgl=27 i lp=130","rokwzgl=28 i lp=130","rokwzgl=29 i lp=130"]
[140,"2.1.1","  z tytułu poręczeń i gwarancji","rokwzgl=0 i lp=140","rokwzgl=0 i lp=140","rokwzgl=1 i lp=140","rokwzgl=2 i lp=140","rokwzgl=3 i lp=140","rokwzgl=4 i lp=140","rokwzgl=5 i lp=140","rokwzgl=6 i lp=140","rokwzgl=7 i lp=140","rokwzgl=8 i lp=140","rokwzgl=9 i lp=140","rokwzgl=10 i lp=140","rokwzgl=11 i lp=140","rokwzgl=12 i lp=140","rokwzgl=13 i lp=140","rokwzgl=14 i lp=140","rokwzgl=15 i lp=140","rokwzgl=16 i lp=140","rokwzgl=17 i lp=140","rokwzgl=18 i lp=140","rokwzgl=19 i lp=140","rokwzgl=20 i lp=140","rokwzgl=21 i lp=140","rokwzgl=22 i lp=140","rokwzgl=23 i lp=140","rokwzgl=24 i lp=140","rokwzgl=25 i lp=140","rokwzgl=26 i lp=140","rokwzgl=27 i lp=140","rokwzgl=28 i lp=140","rokwzgl=29 i lp=140"]
[150,"2.1.1.1","   w tym: gwarancje i poręczenia podlegające wyłączeniu z limitu spłaty zobowiązań, o którym mowa w art. 243 ustawy","rokwzgl=0 i lp=150","rokwzgl=0 i lp=150","rokwzgl=1 i lp=150","rokwzgl=2 i lp=150","rokwzgl=3 i lp=150","rokwzgl=4 i lp=150","rokwzgl=5 i lp=150","rokwzgl=6 i lp=150","rokwzgl=7 i lp=150","rokwzgl=8 i lp=150","rokwzgl=9 i lp=150","rokwzgl=10 i lp=150","rokwzgl=11 i lp=150","rokwzgl=12 i lp=150","rokwzgl=13 i lp=150","rokwzgl=14 i lp=150","rokwzgl=15 i lp=150","rokwzgl=16 i lp=150","rokwzgl=17 i lp=150","rokwzgl=18 i lp=150","rokwzgl=19 i lp=150","rokwzgl=20 i lp=150","rokwzgl=21 i lp=150","rokwzgl=22 i lp=150","rokwzgl=23 i lp=150","rokwzgl=24 i lp=150","rokwzgl=25 i lp=150","rokwzgl=26 i lp=150","rokwzgl=27 i lp=150","rokwzgl=28 i lp=150","rokwzgl=29 i lp=150"]
[160,"2.1.2","   na spłatę przejętych zobowiązań samodzielnego publicznego zakładu opieki zdrowotnej przekształconego na zasadach określonych w przepisach  o działalności leczniczej, w wysokości w jakiej nie podlegają sfinansowaniu dotacją z budżetu państwa","rokwzgl=0 i lp=160","rokwzgl=0 i lp=160","rokwzgl=1 i lp=160","rokwzgl=2 i lp=160","rokwzgl=3 i lp=160","rokwzgl=4 i lp=160","rokwzgl=5 i lp=160","rokwzgl=6 i lp=160","rokwzgl=7 i lp=160","rokwzgl=8 i lp=160","rokwzgl=9 i lp=160","rokwzgl=10 i lp=160","rokwzgl=11 i lp=160","rokwzgl=12 i lp=160","rokwzgl=13 i lp=160","rokwzgl=14 i lp=160","rokwzgl=15 i lp=160","rokwzgl=16 i lp=160","rokwzgl=17 i lp=160","rokwzgl=18 i lp=160","rokwzgl=19 i lp=160","rokwzgl=20 i lp=160","rokwzgl=21 i lp=160","rokwzgl=22 i lp=160","rokwzgl=23 i lp=160","rokwzgl=24 i lp=160","rokwzgl=25 i lp=160","rokwzgl=26 i lp=160","rokwzgl=27 i lp=160","rokwzgl=28 i lp=160","rokwzgl=29 i lp=160"]
[170,"2.1.3","  wydatki na obsługę długu, w tym:","rokwzgl=0 i lp=170","rokwzgl=0 i lp=170","rokwzgl=1 i lp=170","rokwzgl=2 i lp=170","rokwzgl=3 i lp=170","rokwzgl=4 i lp=170","rokwzgl=5 i lp=170","rokwzgl=6 i lp=170","rokwzgl=7 i lp=170","rokwzgl=8 i lp=170","rokwzgl=9 i lp=170","rokwzgl=10 i lp=170","rokwzgl=11 i lp=170","rokwzgl=12 i lp=170","rokwzgl=13 i lp=170","rokwzgl=14 i lp=170","rokwzgl=15 i lp=170","rokwzgl=16 i lp=170","rokwzgl=17 i lp=170","rokwzgl=18 i lp=170","rokwzgl=19 i lp=170","rokwzgl=20 i lp=170","rokwzgl=21 i lp=170","rokwzgl=22 i lp=170","rokwzgl=23 i lp=170","rokwzgl=24 i lp=170","rokwzgl=25 i lp=170","rokwzgl=26 i lp=170","rokwzgl=27 i lp=170","rokwzgl=28 i lp=170","rokwzgl=29 i lp=170"]
[180,"2.1.3.1","   odsetki i dyskonto określone w art. 243 ust. 1 ustawy, w tym:","rokwzgl=0 i lp=180","rokwzgl=0 i lp=180","rokwzgl=1 i lp=180","rokwzgl=2 i lp=180","rokwzgl=3 i lp=180","rokwzgl=4 i lp=180","rokwzgl=5 i lp=180","rokwzgl=6 i lp=180","rokwzgl=7 i lp=180","rokwzgl=8 i lp=180","rokwzgl=9 i lp=180","rokwzgl=10 i lp=180","rokwzgl=11 i lp=180","rokwzgl=12 i lp=180","rokwzgl=13 i lp=180","rokwzgl=14 i lp=180","rokwzgl=15 i lp=180","rokwzgl=16 i lp=180","rokwzgl=17 i lp=180","rokwzgl=18 i lp=180","rokwzgl=19 i lp=180","rokwzgl=20 i lp=180","rokwzgl=21 i lp=180","rokwzgl=22 i lp=180","rokwzgl=23 i lp=180","rokwzgl=24 i lp=180","rokwzgl=25 i lp=180","rokwzgl=26 i lp=180","rokwzgl=27 i lp=180","rokwzgl=28 i lp=180","rokwzgl=29 i lp=180"]
[182,"2.1.3.1.1","    odsetki i dyskonto podlegające wyłączeniu z limitu spłaty zobowiązań, o którym mowa w art. 243 ustawy, w terminie nie dłuższym niż 90 dni po zakończeniu programu, projektu lub zadania i otrzymaniu refundacji z tych środków (bez odsetek i dyskonta od zobowiązań na wkład krajowy)","rokwzgl=0 i lp=182","rokwzgl=0 i lp=182","rokwzgl=1 i lp=182","rokwzgl=2 i lp=182","rokwzgl=3 i lp=182","rokwzgl=4 i lp=182","rokwzgl=5 i lp=182","rokwzgl=6 i lp=182","rokwzgl=7 i lp=182","rokwzgl=8 i lp=182","rokwzgl=9 i lp=182","rokwzgl=10 i lp=182","rokwzgl=11 i lp=182","rokwzgl=12 i lp=182","rokwzgl=13 i lp=182","rokwzgl=14 i lp=182","rokwzgl=15 i lp=182","rokwzgl=16 i lp=182","rokwzgl=17 i lp=182","rokwzgl=18 i lp=182","rokwzgl=19 i lp=182","rokwzgl=20 i lp=182","rokwzgl=21 i lp=182","rokwzgl=22 i lp=182","rokwzgl=23 i lp=182","rokwzgl=24 i lp=182","rokwzgl=25 i lp=182","rokwzgl=26 i lp=182","rokwzgl=27 i lp=182","rokwzgl=28 i lp=182","rokwzgl=29 i lp=182"]
[184,"2.1.3.1.2","    odsetki i dyskonto podlegające wyłączeniu z limitu spłaty zobowiązań, o którym mowa w art. 243 ustawy, z tytułu zobowiązań  zaciągniętych na wkład krajowy","rokwzgl=0 i lp=184","rokwzgl=0 i lp=184","rokwzgl=1 i lp=184","rokwzgl=2 i lp=184","rokwzgl=3 i lp=184","rokwzgl=4 i lp=184","rokwzgl=5 i lp=184","rokwzgl=6 i lp=184","rokwzgl=7 i lp=184","rokwzgl=8 i lp=184","rokwzgl=9 i lp=184","rokwzgl=10 i lp=184","rokwzgl=11 i lp=184","rokwzgl=12 i lp=184","rokwzgl=13 i lp=184","rokwzgl=14 i lp=184","rokwzgl=15 i lp=184","rokwzgl=16 i lp=184","rokwzgl=17 i lp=184","rokwzgl=18 i lp=184","rokwzgl=19 i lp=184","rokwzgl=20 i lp=184","rokwzgl=21 i lp=184","rokwzgl=22 i lp=184","rokwzgl=23 i lp=184","rokwzgl=24 i lp=184","rokwzgl=25 i lp=184","rokwzgl=26 i lp=184","rokwzgl=27 i lp=184","rokwzgl=28 i lp=184","rokwzgl=29 i lp=184"]
[190,"2.2"," Wydatki majątkowe","rokwzgl=0 i lp=190","rokwzgl=0 i lp=190","rokwzgl=1 i lp=190","rokwzgl=2 i lp=190","rokwzgl=3 i lp=190","rokwzgl=4 i lp=190","rokwzgl=5 i lp=190","rokwzgl=6 i lp=190","rokwzgl=7 i lp=190","rokwzgl=8 i lp=190","rokwzgl=9 i lp=190","rokwzgl=10 i lp=190","rokwzgl=11 i lp=190","rokwzgl=12 i lp=190","rokwzgl=13 i lp=190","rokwzgl=14 i lp=190","rokwzgl=15 i lp=190","rokwzgl=16 i lp=190","rokwzgl=17 i lp=190","rokwzgl=18 i lp=190","rokwzgl=19 i lp=190","rokwzgl=20 i lp=190","rokwzgl=21 i lp=190","rokwzgl=22 i lp=190","rokwzgl=23 i lp=190","rokwzgl=24 i lp=190","rokwzgl=25 i lp=190","rokwzgl=26 i lp=190","rokwzgl=27 i lp=190","rokwzgl=28 i lp=190","rokwzgl=29 i lp=190"]
[200,3,"Wynik budżetu","rokwzgl=0 i lp=200","rokwzgl=0 i lp=200","rokwzgl=1 i lp=200","rokwzgl=2 i lp=200","rokwzgl=3 i lp=200","rokwzgl=4 i lp=200","rokwzgl=5 i lp=200","rokwzgl=6 i lp=200","rokwzgl=7 i lp=200","rokwzgl=8 i lp=200","rokwzgl=9 i lp=200","rokwzgl=10 i lp=200","rokwzgl=11 i lp=200","rokwzgl=12 i lp=200","rokwzgl=13 i lp=200","rokwzgl=14 i lp=200","rokwzgl=15 i lp=200","rokwzgl=16 i lp=200","rokwzgl=17 i lp=200","rokwzgl=18 i lp=200","rokwzgl=19 i lp=200","rokwzgl=20 i lp=200","rokwzgl=21 i lp=200","rokwzgl=22 i lp=200","rokwzgl=23 i lp=200","rokwzgl=24 i lp=200","rokwzgl=25 i lp=200","rokwzgl=26 i lp=200","rokwzgl=27 i lp=200","rokwzgl=28 i lp=200","rokwzgl=29 i lp=200"]
[210,4,"Przychody budżetu","rokwzgl=0 i lp=210","rokwzgl=0 i lp=210","rokwzgl=1 i lp=210","rokwzgl=2 i lp=210","rokwzgl=3 i lp=210","rokwzgl=4 i lp=210","rokwzgl=5 i lp=210","rokwzgl=6 i lp=210","rokwzgl=7 i lp=210","rokwzgl=8 i lp=210","rokwzgl=9 i lp=210","rokwzgl=10 i lp=210","rokwzgl=11 i lp=210","rokwzgl=12 i lp=210","rokwzgl=13 i lp=210","rokwzgl=14 i lp=210","rokwzgl=15 i lp=210","rokwzgl=16 i lp=210","rokwzgl=17 i lp=210","rokwzgl=18 i lp=210","rokwzgl=19 i lp=210","rokwzgl=20 i lp=210","rokwzgl=21 i lp=210","rokwzgl=22 i lp=210","rokwzgl=23 i lp=210","rokwzgl=24 i lp=210","rokwzgl=25 i lp=210","rokwzgl=26 i lp=210","rokwzgl=27 i lp=210","rokwzgl=28 i lp=210","rokwzgl=29 i lp=210"]
[220,"4.1"," Nadwyżka budżetowa z lat ubiegłych","rokwzgl=0 i lp=220","rokwzgl=0 i lp=220","rokwzgl=1 i lp=220","rokwzgl=2 i lp=220","rokwzgl=3 i lp=220","rokwzgl=4 i lp=220","rokwzgl=5 i lp=220","rokwzgl=6 i lp=220","rokwzgl=7 i lp=220","rokwzgl=8 i lp=220","rokwzgl=9 i lp=220","rokwzgl=10 i lp=220","rokwzgl=11 i lp=220","rokwzgl=12 i lp=220","rokwzgl=13 i lp=220","rokwzgl=14 i lp=220","rokwzgl=15 i lp=220","rokwzgl=16 i lp=220","rokwzgl=17 i lp=220","rokwzgl=18 i lp=220","rokwzgl=19 i lp=220","rokwzgl=20 i lp=220","rokwzgl=21 i lp=220","rokwzgl=22 i lp=220","rokwzgl=23 i lp=220","rokwzgl=24 i lp=220","rokwzgl=25 i lp=220","rokwzgl=26 i lp=220","rokwzgl=27 i lp=220","rokwzgl=28 i lp=220","rokwzgl=29 i lp=220"]
[230,"4.1.1","  w tym na pokrycie deficytu budżetu","rokwzgl=0 i lp=230","rokwzgl=0 i lp=230","rokwzgl=1 i lp=230","rokwzgl=2 i lp=230","rokwzgl=3 i lp=230","rokwzgl=4 i lp=230","rokwzgl=5 i lp=230","rokwzgl=6 i lp=230","rokwzgl=7 i lp=230","rokwzgl=8 i lp=230","rokwzgl=9 i lp=230","rokwzgl=10 i lp=230","rokwzgl=11 i lp=230","rokwzgl=12 i lp=230","rokwzgl=13 i lp=230","rokwzgl=14 i lp=230","rokwzgl=15 i lp=230","rokwzgl=16 i lp=230","rokwzgl=17 i lp=230","rokwzgl=18 i lp=230","rokwzgl=19 i lp=230","rokwzgl=20 i lp=230","rokwzgl=21 i lp=230","rokwzgl=22 i lp=230","rokwzgl=23 i lp=230","rokwzgl=24 i lp=230","rokwzgl=25 i lp=230","rokwzgl=26 i lp=230","rokwzgl=27 i lp=230","rokwzgl=28 i lp=230","rokwzgl=29 i lp=230"]
[240,"4.2"," Wolne środki, o których mowa w art. 217 ust.2 pkt 6 ustawy","rokwzgl=0 i lp=240","rokwzgl=0 i lp=240","rokwzgl=1 i lp=240","rokwzgl=2 i lp=240","rokwzgl=3 i lp=240","rokwzgl=4 i lp=240","rokwzgl=5 i lp=240","rokwzgl=6 i lp=240","rokwzgl=7 i lp=240","rokwzgl=8 i lp=240","rokwzgl=9 i lp=240","rokwzgl=10 i lp=240","rokwzgl=11 i lp=240","rokwzgl=12 i lp=240","rokwzgl=13 i lp=240","rokwzgl=14 i lp=240","rokwzgl=15 i lp=240","rokwzgl=16 i lp=240","rokwzgl=17 i lp=240","rokwzgl=18 i lp=240","rokwzgl=19 i lp=240","rokwzgl=20 i lp=240","rokwzgl=21 i lp=240","rokwzgl=22 i lp=240","rokwzgl=23 i lp=240","rokwzgl=24 i lp=240","rokwzgl=25 i lp=240","rokwzgl=26 i lp=240","rokwzgl=27 i lp=240","rokwzgl=28 i lp=240","rokwzgl=29 i lp=240"]
[250,"4.2.1","   w tym na pokrycie deficytu budżetu",{"$f":"+\"rokwzgl=\"&D$9&\" i lp=\"&$A36","v":"rokwzgl=0 i lp=250"},"rokwzgl=0 i lp=250","rokwzgl=1 i lp=250","rokwzgl=2 i lp=250","rokwzgl=3 i lp=250","rokwzgl=4 i lp=250","rokwzgl=5 i lp=250","rokwzgl=6 i lp=250","rokwzgl=7 i lp=250","rokwzgl=8 i lp=250",{"$f":"+\"rokwzgl=\"&N$9&\" i lp=\"&$A36","v":"rokwzgl=9 i lp=250"},"rokwzgl=10 i lp=250","rokwzgl=11 i lp=250","rokwzgl=12 i lp=250","rokwzgl=13 i lp=250","rokwzgl=14 i lp=250","rokwzgl=15 i lp=250","rokwzgl=16 i lp=250","rokwzgl=17 i lp=250","rokwzgl=18 i lp=250",{"$f":"+\"rokwzgl=\"&X$9&\" i lp=\"&$A36","v":"rokwzgl=19 i lp=250"},"rokwzgl=20 i lp=250","rokwzgl=21 i lp=250","rokwzgl=22 i lp=250","rokwzgl=23 i lp=250","rokwzgl=24 i lp=250","rokwzgl=25 i lp=250","rokwzgl=26 i lp=250","rokwzgl=27 i lp=250","rokwzgl=28 i lp=250","rokwzgl=29 i lp=250"]
[260,"4.3","  Kredyty, pożyczki, emisja papierów wartościowych","rokwzgl=0 i lp=260","rokwzgl=0 i lp=260","rokwzgl=1 i lp=260","rokwzgl=2 i lp=260","rokwzgl=3 i lp=260","rokwzgl=4 i lp=260","rokwzgl=5 i lp=260","rokwzgl=6 i lp=260","rokwzgl=7 i lp=260","rokwzgl=8 i lp=260","rokwzgl=9 i lp=260","rokwzgl=10 i lp=260","rokwzgl=11 i lp=260","rokwzgl=12 i lp=260","rokwzgl=13 i lp=260","rokwzgl=14 i lp=260","rokwzgl=15 i lp=260","rokwzgl=16 i lp=260","rokwzgl=17 i lp=260","rokwzgl=18 i lp=260","rokwzgl=19 i lp=260","rokwzgl=20 i lp=260","rokwzgl=21 i lp=260","rokwzgl=22 i lp=260","rokwzgl=23 i lp=260","rokwzgl=24 i lp=260","rokwzgl=25 i lp=260","rokwzgl=26 i lp=260","rokwzgl=27 i lp=260","rokwzgl=28 i lp=260","rokwzgl=29 i lp=260"]
[270,"4.3.1","   w tym na pokrycie deficytu budżetu","rokwzgl=0 i lp=270","rokwzgl=0 i lp=270","rokwzgl=1 i lp=270","rokwzgl=2 i lp=270","rokwzgl=3 i lp=270","rokwzgl=4 i lp=270","rokwzgl=5 i lp=270","rokwzgl=6 i lp=270","rokwzgl=7 i lp=270","rokwzgl=8 i lp=270","rokwzgl=9 i lp=270","rokwzgl=10 i lp=270","rokwzgl=11 i lp=270","rokwzgl=12 i lp=270","rokwzgl=13 i lp=270","rokwzgl=14 i lp=270","rokwzgl=15 i lp=270","rokwzgl=16 i lp=270","rokwzgl=17 i lp=270","rokwzgl=18 i lp=270","rokwzgl=19 i lp=270","rokwzgl=20 i lp=270","rokwzgl=21 i lp=270","rokwzgl=22 i lp=270","rokwzgl=23 i lp=270","rokwzgl=24 i lp=270","rokwzgl=25 i lp=270","rokwzgl=26 i lp=270","rokwzgl=27 i lp=270","rokwzgl=28 i lp=270","rokwzgl=29 i lp=270"]
[280,"4.4"," Inne przychody niezwiązane z zaciągnięciem długu","rokwzgl=0 i lp=280","rokwzgl=0 i lp=280","rokwzgl=1 i lp=280","rokwzgl=2 i lp=280","rokwzgl=3 i lp=280","rokwzgl=4 i lp=280","rokwzgl=5 i lp=280","rokwzgl=6 i lp=280","rokwzgl=7 i lp=280","rokwzgl=8 i lp=280","rokwzgl=9 i lp=280","rokwzgl=10 i lp=280","rokwzgl=11 i lp=280","rokwzgl=12 i lp=280","rokwzgl=13 i lp=280","rokwzgl=14 i lp=280","rokwzgl=15 i lp=280","rokwzgl=16 i lp=280","rokwzgl=17 i lp=280","rokwzgl=18 i lp=280","rokwzgl=19 i lp=280","rokwzgl=20 i lp=280","rokwzgl=21 i lp=280","rokwzgl=22 i lp=280","rokwzgl=23 i lp=280","rokwzgl=24 i lp=280","rokwzgl=25 i lp=280","rokwzgl=26 i lp=280","rokwzgl=27 i lp=280","rokwzgl=28 i lp=280","rokwzgl=29 i lp=280"]
[290,"4.4.1","   w tym na pokrycie deficytu budżetu","rokwzgl=0 i lp=290","rokwzgl=0 i lp=290","rokwzgl=1 i lp=290","rokwzgl=2 i lp=290","rokwzgl=3 i lp=290","rokwzgl=4 i lp=290","rokwzgl=5 i lp=290","rokwzgl=6 i lp=290","rokwzgl=7 i lp=290","rokwzgl=8 i lp=290","rokwzgl=9 i lp=290","rokwzgl=10 i lp=290","rokwzgl=11 i lp=290","rokwzgl=12 i lp=290","rokwzgl=13 i lp=290","rokwzgl=14 i lp=290","rokwzgl=15 i lp=290","rokwzgl=16 i lp=290","rokwzgl=17 i lp=290","rokwzgl=18 i lp=290","rokwzgl=19 i lp=290","rokwzgl=20 i lp=290","rokwzgl=21 i lp=290","rokwzgl=22 i lp=290","rokwzgl=23 i lp=290","rokwzgl=24 i lp=290","rokwzgl=25 i lp=290","rokwzgl=26 i lp=290","rokwzgl=27 i lp=290","rokwzgl=28 i lp=290","rokwzgl=29 i lp=290"]
[300,5,"Rozchody budżetu","rokwzgl=0 i lp=300","rokwzgl=0 i lp=300","rokwzgl=1 i lp=300","rokwzgl=2 i lp=300","rokwzgl=3 i lp=300","rokwzgl=4 i lp=300","rokwzgl=5 i lp=300","rokwzgl=6 i lp=300","rokwzgl=7 i lp=300","rokwzgl=8 i lp=300","rokwzgl=9 i lp=300","rokwzgl=10 i lp=300","rokwzgl=11 i lp=300","rokwzgl=12 i lp=300","rokwzgl=13 i lp=300","rokwzgl=14 i lp=300","rokwzgl=15 i lp=300","rokwzgl=16 i lp=300","rokwzgl=17 i lp=300","rokwzgl=18 i lp=300","rokwzgl=19 i lp=300","rokwzgl=20 i lp=300","rokwzgl=21 i lp=300","rokwzgl=22 i lp=300","rokwzgl=23 i lp=300","rokwzgl=24 i lp=300","rokwzgl=25 i lp=300","rokwzgl=26 i lp=300","rokwzgl=27 i lp=300","rokwzgl=28 i lp=300","rokwzgl=29 i lp=300"]
[310,"5.1"," Spłaty rat kapitałowych kredytów i pożyczek oraz wykup papierów wartościowych","rokwzgl=0 i lp=310","rokwzgl=0 i lp=310","rokwzgl=1 i lp=310","rokwzgl=2 i lp=310","rokwzgl=3 i lp=310","rokwzgl=4 i lp=310","rokwzgl=5 i lp=310","rokwzgl=6 i lp=310","rokwzgl=7 i lp=310","rokwzgl=8 i lp=310","rokwzgl=9 i lp=310","rokwzgl=10 i lp=310","rokwzgl=11 i lp=310","rokwzgl=12 i lp=310","rokwzgl=13 i lp=310","rokwzgl=14 i lp=310","rokwzgl=15 i lp=310","rokwzgl=16 i lp=310","rokwzgl=17 i lp=310","rokwzgl=18 i lp=310","rokwzgl=19 i lp=310","rokwzgl=20 i lp=310","rokwzgl=21 i lp=310","rokwzgl=22 i lp=310","rokwzgl=23 i lp=310","rokwzgl=24 i lp=310","rokwzgl=25 i lp=310","rokwzgl=26 i lp=310","rokwzgl=27 i lp=310","rokwzgl=28 i lp=310","rokwzgl=29 i lp=310"]
[320,"5.1.1","  w tym łączna kwota przypadających na dany rok kwot ustawowych wyłączeń z limitu spłaty zobowiązań, o którym mowa w art. 243 ustawy, z tego:","rokwzgl=0 i lp=320","rokwzgl=0 i lp=320","rokwzgl=1 i lp=320","rokwzgl=2 i lp=320","rokwzgl=3 i lp=320","rokwzgl=4 i lp=320","rokwzgl=5 i lp=320","rokwzgl=6 i lp=320","rokwzgl=7 i lp=320","rokwzgl=8 i lp=320","rokwzgl=9 i lp=320","rokwzgl=10 i lp=320","rokwzgl=11 i lp=320","rokwzgl=12 i lp=320","rokwzgl=13 i lp=320","rokwzgl=14 i lp=320","rokwzgl=15 i lp=320","rokwzgl=16 i lp=320","rokwzgl=17 i lp=320","rokwzgl=18 i lp=320","rokwzgl=19 i lp=320","rokwzgl=20 i lp=320","rokwzgl=21 i lp=320","rokwzgl=22 i lp=320","rokwzgl=23 i lp=320","rokwzgl=24 i lp=320","rokwzgl=25 i lp=320","rokwzgl=26 i lp=320","rokwzgl=27 i lp=320","rokwzgl=28 i lp=320","rokwzgl=29 i lp=320"]
[332,"5.1.1.1","   kwota przypadających na dany rok kwot ustawowych wyłączeń określonych w art. 243 ust. 3 ustawy","rokwzgl=0 i lp=332","rokwzgl=0 i lp=332","rokwzgl=1 i lp=332","rokwzgl=2 i lp=332","rokwzgl=3 i lp=332","rokwzgl=4 i lp=332","rokwzgl=5 i lp=332","rokwzgl=6 i lp=332","rokwzgl=7 i lp=332","rokwzgl=8 i lp=332","rokwzgl=9 i lp=332","rokwzgl=10 i lp=332","rokwzgl=11 i lp=332","rokwzgl=12 i lp=332","rokwzgl=13 i lp=332","rokwzgl=14 i lp=332","rokwzgl=15 i lp=332","rokwzgl=16 i lp=332","rokwzgl=17 i lp=332","rokwzgl=18 i lp=332","rokwzgl=19 i lp=332","rokwzgl=20 i lp=332","rokwzgl=21 i lp=332","rokwzgl=22 i lp=332","rokwzgl=23 i lp=332","rokwzgl=24 i lp=332","rokwzgl=25 i lp=332","rokwzgl=26 i lp=332","rokwzgl=27 i lp=332","rokwzgl=28 i lp=332","rokwzgl=29 i lp=332"]
[334,"5.1.1.2","   kwota przypadających na dany rok kwot ustawowych wyłączeń określonych w art. 243 ust. 3a ustawy","rokwzgl=0 i lp=334","rokwzgl=0 i lp=334","rokwzgl=1 i lp=334","rokwzgl=2 i lp=334","rokwzgl=3 i lp=334","rokwzgl=4 i lp=334","rokwzgl=5 i lp=334","rokwzgl=6 i lp=334","rokwzgl=7 i lp=334","rokwzgl=8 i lp=334","rokwzgl=9 i lp=334","rokwzgl=10 i lp=334","rokwzgl=11 i lp=334","rokwzgl=12 i lp=334","rokwzgl=13 i lp=334","rokwzgl=14 i lp=334","rokwzgl=15 i lp=334","rokwzgl=16 i lp=334","rokwzgl=17 i lp=334","rokwzgl=18 i lp=334","rokwzgl=19 i lp=334","rokwzgl=20 i lp=334","rokwzgl=21 i lp=334","rokwzgl=22 i lp=334","rokwzgl=23 i lp=334","rokwzgl=24 i lp=334","rokwzgl=25 i lp=334","rokwzgl=26 i lp=334","rokwzgl=27 i lp=334","rokwzgl=28 i lp=334","rokwzgl=29 i lp=334"]
[336,"5.1.1.3","   kwota przypadających na dany rok kwot ustawowych wyłączeń innych niż określone w art. 243 ustawy",{"$f":"+\"rokwzgl=\"&D$9&\" i lp=\"&$A46","v":"rokwzgl=0 i lp=336"},"rokwzgl=0 i lp=336","rokwzgl=1 i lp=336","rokwzgl=2 i lp=336","rokwzgl=3 i lp=336","rokwzgl=4 i lp=336","rokwzgl=5 i lp=336","rokwzgl=6 i lp=336","rokwzgl=7 i lp=336","rokwzgl=8 i lp=336",{"$f":"+\"rokwzgl=\"&N$9&\" i lp=\"&$A46","v":"rokwzgl=9 i lp=336"},"rokwzgl=10 i lp=336","rokwzgl=11 i lp=336","rokwzgl=12 i lp=336","rokwzgl=13 i lp=336","rokwzgl=14 i lp=336","rokwzgl=15 i lp=336","rokwzgl=16 i lp=336","rokwzgl=17 i lp=336","rokwzgl=18 i lp=336",{"$f":"+\"rokwzgl=\"&X$9&\" i lp=\"&$A46","v":"rokwzgl=19 i lp=336"},"rokwzgl=20 i lp=336","rokwzgl=21 i lp=336","rokwzgl=22 i lp=336","rokwzgl=23 i lp=336","rokwzgl=24 i lp=336","rokwzgl=25 i lp=336","rokwzgl=26 i lp=336","rokwzgl=27 i lp=336","rokwzgl=28 i lp=336","rokwzgl=29 i lp=336"]
[340,"5.2"," Inne rozchody niezwiązane ze spłatą długu","rokwzgl=0 i lp=340","rokwzgl=0 i lp=340","rokwzgl=1 i lp=340","rokwzgl=2 i lp=340","rokwzgl=3 i lp=340","rokwzgl=4 i lp=340","rokwzgl=5 i lp=340","rokwzgl=6 i lp=340","rokwzgl=7 i lp=340","rokwzgl=8 i lp=340","rokwzgl=9 i lp=340","rokwzgl=10 i lp=340","rokwzgl=11 i lp=340","rokwzgl=12 i lp=340","rokwzgl=13 i lp=340","rokwzgl=14 i lp=340","rokwzgl=15 i lp=340","rokwzgl=16 i lp=340","rokwzgl=17 i lp=340","rokwzgl=18 i lp=340","rokwzgl=19 i lp=340","rokwzgl=20 i lp=340","rokwzgl=21 i lp=340","rokwzgl=22 i lp=340","rokwzgl=23 i lp=340","rokwzgl=24 i lp=340","rokwzgl=25 i lp=340","rokwzgl=26 i lp=340","rokwzgl=27 i lp=340","rokwzgl=28 i lp=340","rokwzgl=29 i lp=340"]
[350,6,"Kwota długu","rokwzgl=0 i lp=350","rokwzgl=0 i lp=350","rokwzgl=1 i lp=350","rokwzgl=2 i lp=350","rokwzgl=3 i lp=350","rokwzgl=4 i lp=350","rokwzgl=5 i lp=350","rokwzgl=6 i lp=350","rokwzgl=7 i lp=350","rokwzgl=8 i lp=350","rokwzgl=9 i lp=350","rokwzgl=10 i lp=350","rokwzgl=11 i lp=350","rokwzgl=12 i lp=350","rokwzgl=13 i lp=350","rokwzgl=14 i lp=350","rokwzgl=15 i lp=350","rokwzgl=16 i lp=350","rokwzgl=17 i lp=350","rokwzgl=18 i lp=350","rokwzgl=19 i lp=350","rokwzgl=20 i lp=350","rokwzgl=21 i lp=350","rokwzgl=22 i lp=350","rokwzgl=23 i lp=350","rokwzgl=24 i lp=350","rokwzgl=25 i lp=350","rokwzgl=26 i lp=350","rokwzgl=27 i lp=350","rokwzgl=28 i lp=350","rokwzgl=29 i lp=350"]
[400,7,"Kwota zobowiązań wynikających z przejęcia przez jednostkę samorządu terytorialnego zobowiązań po likwidowanych i przekształcanych jednostkach zaliczanych do sektora  finansów publicznych","rokwzgl=0 i lp=400","rokwzgl=0 i lp=400","rokwzgl=1 i lp=400","rokwzgl=2 i lp=400","rokwzgl=3 i lp=400","rokwzgl=4 i lp=400","rokwzgl=5 i lp=400","rokwzgl=6 i lp=400","rokwzgl=7 i lp=400","rokwzgl=8 i lp=400","rokwzgl=9 i lp=400","rokwzgl=10 i lp=400","rokwzgl=11 i lp=400","rokwzgl=12 i lp=400","rokwzgl=13 i lp=400","rokwzgl=14 i lp=400","rokwzgl=15 i lp=400","rokwzgl=16 i lp=400","rokwzgl=17 i lp=400","rokwzgl=18 i lp=400","rokwzgl=19 i lp=400","rokwzgl=20 i lp=400","rokwzgl=21 i lp=400","rokwzgl=22 i lp=400","rokwzgl=23 i lp=400","rokwzgl=24 i lp=400","rokwzgl=25 i lp=400","rokwzgl=26 i lp=400","rokwzgl=27 i lp=400","rokwzgl=28 i lp=400","rokwzgl=29 i lp=400"]
[410,8,"Relacja zrównoważenia wydatków bieżących, o której mowa w art. 242 ustawy","rokwzgl=0 i lp=410","rokwzgl=0 i lp=410","rokwzgl=1 i lp=410","rokwzgl=2 i lp=410","rokwzgl=3 i lp=410","rokwzgl=4 i lp=410","rokwzgl=5 i lp=410","rokwzgl=6 i lp=410","rokwzgl=7 i lp=410","rokwzgl=8 i lp=410","rokwzgl=9 i lp=410","rokwzgl=10 i lp=410","rokwzgl=11 i lp=410","rokwzgl=12 i lp=410","rokwzgl=13 i lp=410","rokwzgl=14 i lp=410","rokwzgl=15 i lp=410","rokwzgl=16 i lp=410","rokwzgl=17 i lp=410","rokwzgl=18 i lp=410","rokwzgl=19 i lp=410","rokwzgl=20 i lp=410","rokwzgl=21 i lp=410","rokwzgl=22 i lp=410","rokwzgl=23 i lp=410","rokwzgl=24 i lp=410","rokwzgl=25 i lp=410","rokwzgl=26 i lp=410","rokwzgl=27 i lp=410","rokwzgl=28 i lp=410","rokwzgl=29 i lp=410"]
[420,"8.1"," Różnica między dochodami bieżącymi a  wydatkami bieżącymi","rokwzgl=0 i lp=420","rokwzgl=0 i lp=420","rokwzgl=1 i lp=420","rokwzgl=2 i lp=420","rokwzgl=3 i lp=420","rokwzgl=4 i lp=420","rokwzgl=5 i lp=420","rokwzgl=6 i lp=420","rokwzgl=7 i lp=420","rokwzgl=8 i lp=420","rokwzgl=9 i lp=420","rokwzgl=10 i lp=420","rokwzgl=11 i lp=420","rokwzgl=12 i lp=420","rokwzgl=13 i lp=420","rokwzgl=14 i lp=420","rokwzgl=15 i lp=420","rokwzgl=16 i lp=420","rokwzgl=17 i lp=420","rokwzgl=18 i lp=420","rokwzgl=19 i lp=420","rokwzgl=20 i lp=420","rokwzgl=21 i lp=420","rokwzgl=22 i lp=420","rokwzgl=23 i lp=420","rokwzgl=24 i lp=420","rokwzgl=25 i lp=420","rokwzgl=26 i lp=420","rokwzgl=27 i lp=420","rokwzgl=28 i lp=420","rokwzgl=29 i lp=420"]
[430,"8.2"," Różnica między dochodami bieżącymi, skorygowanymi o środki a wydatkami bieżącymi, pomniejszonymi  o wydatki","rokwzgl=0 i lp=430","rokwzgl=0 i lp=430","rokwzgl=1 i lp=430","rokwzgl=2 i lp=430","rokwzgl=3 i lp=430","rokwzgl=4 i lp=430","rokwzgl=5 i lp=430","rokwzgl=6 i lp=430","rokwzgl=7 i lp=430","rokwzgl=8 i lp=430","rokwzgl=9 i lp=430","rokwzgl=10 i lp=430","rokwzgl=11 i lp=430","rokwzgl=12 i lp=430","rokwzgl=13 i lp=430","rokwzgl=14 i lp=430","rokwzgl=15 i lp=430","rokwzgl=16 i lp=430","rokwzgl=17 i lp=430","rokwzgl=18 i lp=430","rokwzgl=19 i lp=430","rokwzgl=20 i lp=430","rokwzgl=21 i lp=430","rokwzgl=22 i lp=430","rokwzgl=23 i lp=430","rokwzgl=24 i lp=430","rokwzgl=25 i lp=430","rokwzgl=26 i lp=430","rokwzgl=27 i lp=430","rokwzgl=28 i lp=430","rokwzgl=29 i lp=430"]
[440,9,"Wskaźnik spłaty zobowiązań","rokwzgl=0 i lp=440","rokwzgl=0 i lp=440","rokwzgl=1 i lp=440","rokwzgl=2 i lp=440","rokwzgl=3 i lp=440","rokwzgl=4 i lp=440","rokwzgl=5 i lp=440","rokwzgl=6 i lp=440","rokwzgl=7 i lp=440","rokwzgl=8 i lp=440","rokwzgl=9 i lp=440","rokwzgl=10 i lp=440","rokwzgl=11 i lp=440","rokwzgl=12 i lp=440","rokwzgl=13 i lp=440","rokwzgl=14 i lp=440","rokwzgl=15 i lp=440","rokwzgl=16 i lp=440","rokwzgl=17 i lp=440","rokwzgl=18 i lp=440","rokwzgl=19 i lp=440","rokwzgl=20 i lp=440","rokwzgl=21 i lp=440","rokwzgl=22 i lp=440","rokwzgl=23 i lp=440","rokwzgl=24 i lp=440","rokwzgl=25 i lp=440","rokwzgl=26 i lp=440","rokwzgl=27 i lp=440","rokwzgl=28 i lp=440","rokwzgl=29 i lp=440"]
[470,"9.1"," Wskaźnik planowanej łącznej kwoty spłaty zobowiązań, o której mowa w art. 243 ust. 1 ustawy do dochodów, bez uwzględnienia zobowiązań związku współtworzonego przez jednostkę samorządu terytorialnego  i bez uwzględnienia ustawowych wyłączeń przypadających na dany rok.","rokwzgl=0 i lp=470","rokwzgl=0 i lp=470","rokwzgl=1 i lp=470","rokwzgl=2 i lp=470","rokwzgl=3 i lp=470","rokwzgl=4 i lp=470","rokwzgl=5 i lp=470","rokwzgl=6 i lp=470","rokwzgl=7 i lp=470","rokwzgl=8 i lp=470","rokwzgl=9 i lp=470","rokwzgl=10 i lp=470","rokwzgl=11 i lp=470","rokwzgl=12 i lp=470","rokwzgl=13 i lp=470","rokwzgl=14 i lp=470","rokwzgl=15 i lp=470","rokwzgl=16 i lp=470","rokwzgl=17 i lp=470","rokwzgl=18 i lp=470","rokwzgl=19 i lp=470","rokwzgl=20 i lp=470","rokwzgl=21 i lp=470","rokwzgl=22 i lp=470","rokwzgl=23 i lp=470","rokwzgl=24 i lp=470","rokwzgl=25 i lp=470","rokwzgl=26 i lp=470","rokwzgl=27 i lp=470","rokwzgl=28 i lp=470","rokwzgl=29 i lp=470"]
[480,"9.2"," Wskaźnik planowanej łącznej kwoty spłaty zobowiązań, o której mowa w art. 243 ust. 1 ustawy do dochodów, bez uwzględnienia zobowiązań związku współtworzonego przez jednostkę samorządu terytorialnego, po uwzględnieniu ustawowych wyłączeń przypadających na dany rok.","rokwzgl=0 i lp=480","rokwzgl=0 i lp=480","rokwzgl=1 i lp=480","rokwzgl=2 i lp=480","rokwzgl=3 i lp=480","rokwzgl=4 i lp=480","rokwzgl=5 i lp=480","rokwzgl=6 i lp=480","rokwzgl=7 i lp=480","rokwzgl=8 i lp=480","rokwzgl=9 i lp=480","rokwzgl=10 i lp=480","rokwzgl=11 i lp=480","rokwzgl=12 i lp=480","rokwzgl=13 i lp=480","rokwzgl=14 i lp=480","rokwzgl=15 i lp=480","rokwzgl=16 i lp=480","rokwzgl=17 i lp=480","rokwzgl=18 i lp=480","rokwzgl=19 i lp=480","rokwzgl=20 i lp=480","rokwzgl=21 i lp=480","rokwzgl=22 i lp=480","rokwzgl=23 i lp=480","rokwzgl=24 i lp=480","rokwzgl=25 i lp=480","rokwzgl=26 i lp=480","rokwzgl=27 i lp=480","rokwzgl=28 i lp=480","rokwzgl=29 i lp=480"]
[490,"9.3"," Kwota zobowiązań związku współtworzonego przez jednostkę samorządu terytorialnego przypadających do spłaty w danym roku budżetowym, podlegająca doliczeniu zgodnie z art. 244 ustawy",{"$f":"+\"rokwzgl=\"&D$9&\" i lp=\"&$A56","v":"rokwzgl=0 i lp=490"},"rokwzgl=0 i lp=490","rokwzgl=1 i lp=490","rokwzgl=2 i lp=490","rokwzgl=3 i lp=490","rokwzgl=4 i lp=490","rokwzgl=5 i lp=490","rokwzgl=6 i lp=490","rokwzgl=7 i lp=490","rokwzgl=8 i lp=490",{"$f":"+\"rokwzgl=\"&N$9&\" i lp=\"&$A56","v":"rokwzgl=9 i lp=490"},"rokwzgl=10 i lp=490","rokwzgl=11 i lp=490","rokwzgl=12 i lp=490","rokwzgl=13 i lp=490","rokwzgl=14 i lp=490","rokwzgl=15 i lp=490","rokwzgl=16 i lp=490","rokwzgl=17 i lp=490","rokwzgl=18 i lp=490",{"$f":"+\"rokwzgl=\"&X$9&\" i lp=\"&$A56","v":"rokwzgl=19 i lp=490"},"rokwzgl=20 i lp=490","rokwzgl=21 i lp=490","rokwzgl=22 i lp=490","rokwzgl=23 i lp=490","rokwzgl=24 i lp=490","rokwzgl=25 i lp=490","rokwzgl=26 i lp=490","rokwzgl=27 i lp=490","rokwzgl=28 i lp=490","rokwzgl=29 i lp=490"]
[500,"9.4"," Wskaźnik planowanej łącznej kwoty spłaty zobowiązań, o której mowa w art. 243 ust. 1 ustawy do dochodów, po uwzględnieniu zobowiązań związku współtworzonego przez jednostkę samorządu terytorialnego oraz po uwzględnieniu ustawowych wyłączeń przypadających na dany rok","rokwzgl=0 i lp=500","rokwzgl=0 i lp=500","rokwzgl=1 i lp=500","rokwzgl=2 i lp=500","rokwzgl=3 i lp=500","rokwzgl=4 i lp=500","rokwzgl=5 i lp=500","rokwzgl=6 i lp=500","rokwzgl=7 i lp=500","rokwzgl=8 i lp=500","rokwzgl=9 i lp=500","rokwzgl=10 i lp=500","rokwzgl=11 i lp=500","rokwzgl=12 i lp=500","rokwzgl=13 i lp=500","rokwzgl=14 i lp=500","rokwzgl=15 i lp=500","rokwzgl=16 i lp=500","rokwzgl=17 i lp=500","rokwzgl=18 i lp=500","rokwzgl=19 i lp=500","rokwzgl=20 i lp=500","rokwzgl=21 i lp=500","rokwzgl=22 i lp=500","rokwzgl=23 i lp=500","rokwzgl=24 i lp=500","rokwzgl=25 i lp=500","rokwzgl=26 i lp=500","rokwzgl=27 i lp=500","rokwzgl=28 i lp=500","rokwzgl=29 i lp=500"]
[508,"9.5"," Wskaźnik dochodów bieżących powiększonych o dochody ze sprzedaży majątku oraz pomniejszonych o wydatki bieżące, do dochodów budżetu, ustalony dla danego roku (wskaźnik jednoroczny)","rokwzgl=0 i lp=508","rokwzgl=0 i lp=508","rokwzgl=1 i lp=508","rokwzgl=2 i lp=508","rokwzgl=3 i lp=508","rokwzgl=4 i lp=508","rokwzgl=5 i lp=508","rokwzgl=6 i lp=508","rokwzgl=7 i lp=508","rokwzgl=8 i lp=508","rokwzgl=9 i lp=508","rokwzgl=10 i lp=508","rokwzgl=11 i lp=508","rokwzgl=12 i lp=508","rokwzgl=13 i lp=508","rokwzgl=14 i lp=508","rokwzgl=15 i lp=508","rokwzgl=16 i lp=508","rokwzgl=17 i lp=508","rokwzgl=18 i lp=508","rokwzgl=19 i lp=508","rokwzgl=20 i lp=508","rokwzgl=21 i lp=508","rokwzgl=22 i lp=508","rokwzgl=23 i lp=508","rokwzgl=24 i lp=508","rokwzgl=25 i lp=508","rokwzgl=26 i lp=508","rokwzgl=27 i lp=508","rokwzgl=28 i lp=508","rokwzgl=29 i lp=508"]
[510,"9.6"," Dopuszczalny wskaźnik spłaty zobowiązań określony w art. 243 ustawy, po uwzględnieniu ustawowych wyłączeń , obliczony w oparciu o plan 3 kwartału roku poprzedzającego pierwszy rok prognozy (wskaźnik ustalony w oparciu o średnią arytmetyczną z 3 poprzednich lat) ","rokwzgl=0 i lp=510","rokwzgl=0 i lp=510","rokwzgl=1 i lp=510","rokwzgl=2 i lp=510","rokwzgl=3 i lp=510","rokwzgl=4 i lp=510","rokwzgl=5 i lp=510","rokwzgl=6 i lp=510","rokwzgl=7 i lp=510","rokwzgl=8 i lp=510","rokwzgl=9 i lp=510","rokwzgl=10 i lp=510","rokwzgl=11 i lp=510","rokwzgl=12 i lp=510","rokwzgl=13 i lp=510","rokwzgl=14 i lp=510","rokwzgl=15 i lp=510","rokwzgl=16 i lp=510","rokwzgl=17 i lp=510","rokwzgl=18 i lp=510","rokwzgl=19 i lp=510","rokwzgl=20 i lp=510","rokwzgl=21 i lp=510","rokwzgl=22 i lp=510","rokwzgl=23 i lp=510","rokwzgl=24 i lp=510","rokwzgl=25 i lp=510","rokwzgl=26 i lp=510","rokwzgl=27 i lp=510","rokwzgl=28 i lp=510","rokwzgl=29 i lp=510"]
[520,"9.6.1","   Dopuszczalny wskaźnik spłaty zobowiązań określony w art. 243 ustawy, po uwzględnieniu ustawowych wyłączeń, obliczony w oparciu o wykonanie roku poprzedzającego pierwszy rok prognozy (wskaźnik ustalony w oparciu o średnią arytmetyczną z 3 poprzednich lat) ","rokwzgl=0 i lp=520","rokwzgl=0 i lp=520","rokwzgl=1 i lp=520","rokwzgl=2 i lp=520","rokwzgl=3 i lp=520","rokwzgl=4 i lp=520","rokwzgl=5 i lp=520","rokwzgl=6 i lp=520","rokwzgl=7 i lp=520","rokwzgl=8 i lp=520","rokwzgl=9 i lp=520","rokwzgl=10 i lp=520","rokwzgl=11 i lp=520","rokwzgl=12 i lp=520","rokwzgl=13 i lp=520","rokwzgl=14 i lp=520","rokwzgl=15 i lp=520","rokwzgl=16 i lp=520","rokwzgl=17 i lp=520","rokwzgl=18 i lp=520","rokwzgl=19 i lp=520","rokwzgl=20 i lp=520","rokwzgl=21 i lp=520","rokwzgl=22 i lp=520","rokwzgl=23 i lp=520","rokwzgl=24 i lp=520","rokwzgl=25 i lp=520","rokwzgl=26 i lp=520","rokwzgl=27 i lp=520","rokwzgl=28 i lp=520","rokwzgl=29 i lp=520"]
[530,"9.7"," Informacja o spełnieniu wskaźnika spłaty zobowiązań określonego w art. 243 ustawy, po uwzględnieniu zobowiązań związku współtworzonego przez jednostkę samorządu terytorialnego oraz po uwzględnieniu ustawowych wyłączeń, obliczonego w oparciu o plan 3 kwartałów roku poprzedzającego rok budżetowy","rokwzgl=0 i lp=530","rokwzgl=0 i lp=530","rokwzgl=1 i lp=530","rokwzgl=2 i lp=530","rokwzgl=3 i lp=530","rokwzgl=4 i lp=530","rokwzgl=5 i lp=530","rokwzgl=6 i lp=530","rokwzgl=7 i lp=530","rokwzgl=8 i lp=530","rokwzgl=9 i lp=530","rokwzgl=10 i lp=530","rokwzgl=11 i lp=530","rokwzgl=12 i lp=530","rokwzgl=13 i lp=530","rokwzgl=14 i lp=530","rokwzgl=15 i lp=530","rokwzgl=16 i lp=530","rokwzgl=17 i lp=530","rokwzgl=18 i lp=530","rokwzgl=19 i lp=530","rokwzgl=20 i lp=530","rokwzgl=21 i lp=530","rokwzgl=22 i lp=530","rokwzgl=23 i lp=530","rokwzgl=24 i lp=530","rokwzgl=25 i lp=530","rokwzgl=26 i lp=530","rokwzgl=27 i lp=530","rokwzgl=28 i lp=530","rokwzgl=29 i lp=530"]
[540,"9.7.1","  Informacja o spełnieniu wskaźnika spłaty zobowiązań określonego w art. 243 ustawy, po uwzględnieniu zobowiązań związku współtworzonego przez jednostkę samorządu terytorialnego oraz po uwzględnieniu ustawowych wyłączeń, obliczonego w oparciu o wykonanie roku poprzedzającego rok budżetowy","rokwzgl=0 i lp=540","rokwzgl=0 i lp=540","rokwzgl=1 i lp=540","rokwzgl=2 i lp=540","rokwzgl=3 i lp=540","rokwzgl=4 i lp=540","rokwzgl=5 i lp=540","rokwzgl=6 i lp=540","rokwzgl=7 i lp=540","rokwzgl=8 i lp=540","rokwzgl=9 i lp=540","rokwzgl=10 i lp=540","rokwzgl=11 i lp=540","rokwzgl=12 i lp=540","rokwzgl=13 i lp=540","rokwzgl=14 i lp=540","rokwzgl=15 i lp=540","rokwzgl=16 i lp=540","rokwzgl=17 i lp=540","rokwzgl=18 i lp=540","rokwzgl=19 i lp=540","rokwzgl=20 i lp=540","rokwzgl=21 i lp=540","rokwzgl=22 i lp=540","rokwzgl=23 i lp=540","rokwzgl=24 i lp=540","rokwzgl=25 i lp=540","rokwzgl=26 i lp=540","rokwzgl=27 i lp=540","rokwzgl=28 i lp=540","rokwzgl=29 i lp=540"]
[550,10,"Przeznaczenie prognozowanej nadwyżki budżetowej,  w tym na:","rokwzgl=0 i lp=550","rokwzgl=0 i lp=550","rokwzgl=1 i lp=550","rokwzgl=2 i lp=550","rokwzgl=3 i lp=550","rokwzgl=4 i lp=550","rokwzgl=5 i lp=550","rokwzgl=6 i lp=550","rokwzgl=7 i lp=550","rokwzgl=8 i lp=550","rokwzgl=9 i lp=550","rokwzgl=10 i lp=550","rokwzgl=11 i lp=550","rokwzgl=12 i lp=550","rokwzgl=13 i lp=550","rokwzgl=14 i lp=550","rokwzgl=15 i lp=550","rokwzgl=16 i lp=550","rokwzgl=17 i lp=550","rokwzgl=18 i lp=550","rokwzgl=19 i lp=550","rokwzgl=20 i lp=550","rokwzgl=21 i lp=550","rokwzgl=22 i lp=550","rokwzgl=23 i lp=550","rokwzgl=24 i lp=550","rokwzgl=25 i lp=550","rokwzgl=26 i lp=550","rokwzgl=27 i lp=550","rokwzgl=28 i lp=550","rokwzgl=29 i lp=550"]
[560,"10.1"," Spłaty kredytów, pożyczek i wykup papierów wartościowych","rokwzgl=0 i lp=560","rokwzgl=0 i lp=560","rokwzgl=1 i lp=560","rokwzgl=2 i lp=560","rokwzgl=3 i lp=560","rokwzgl=4 i lp=560","rokwzgl=5 i lp=560","rokwzgl=6 i lp=560","rokwzgl=7 i lp=560","rokwzgl=8 i lp=560","rokwzgl=9 i lp=560","rokwzgl=10 i lp=560","rokwzgl=11 i lp=560","rokwzgl=12 i lp=560","rokwzgl=13 i lp=560","rokwzgl=14 i lp=560","rokwzgl=15 i lp=560","rokwzgl=16 i lp=560","rokwzgl=17 i lp=560","rokwzgl=18 i lp=560","rokwzgl=19 i lp=560","rokwzgl=20 i lp=560","rokwzgl=21 i lp=560","rokwzgl=22 i lp=560","rokwzgl=23 i lp=560","rokwzgl=24 i lp=560","rokwzgl=25 i lp=560","rokwzgl=26 i lp=560","rokwzgl=27 i lp=560","rokwzgl=28 i lp=560","rokwzgl=29 i lp=560"]
[570,11,"Informacje uzupełniające o wybranych rodzajach wydatków budżetowych","rokwzgl=0 i lp=570","rokwzgl=0 i lp=570","rokwzgl=1 i lp=570","rokwzgl=2 i lp=570","rokwzgl=3 i lp=570","rokwzgl=4 i lp=570","rokwzgl=5 i lp=570","rokwzgl=6 i lp=570","rokwzgl=7 i lp=570","rokwzgl=8 i lp=570","rokwzgl=9 i lp=570","rokwzgl=10 i lp=570","rokwzgl=11 i lp=570","rokwzgl=12 i lp=570","rokwzgl=13 i lp=570","rokwzgl=14 i lp=570","rokwzgl=15 i lp=570","rokwzgl=16 i lp=570","rokwzgl=17 i lp=570","rokwzgl=18 i lp=570","rokwzgl=19 i lp=570","rokwzgl=20 i lp=570","rokwzgl=21 i lp=570","rokwzgl=22 i lp=570","rokwzgl=23 i lp=570","rokwzgl=24 i lp=570","rokwzgl=25 i lp=570","rokwzgl=26 i lp=570","rokwzgl=27 i lp=570","rokwzgl=28 i lp=570","rokwzgl=29 i lp=570"]
[580,"11.1"," Wydatki bieżące na wynagrodzenia i składki od nich naliczane",{"$f":"+\"rokwzgl=\"&D$9&\" i lp=\"&$A66","v":"rokwzgl=0 i lp=580"},"rokwzgl=0 i lp=580","rokwzgl=1 i lp=580","rokwzgl=2 i lp=580","rokwzgl=3 i lp=580","rokwzgl=4 i lp=580","rokwzgl=5 i lp=580","rokwzgl=6 i lp=580","rokwzgl=7 i lp=580","rokwzgl=8 i lp=580",{"$f":"+\"rokwzgl=\"&N$9&\" i lp=\"&$A66","v":"rokwzgl=9 i lp=580"},"rokwzgl=10 i lp=580","rokwzgl=11 i lp=580","rokwzgl=12 i lp=580","rokwzgl=13 i lp=580","rokwzgl=14 i lp=580","rokwzgl=15 i lp=580","rokwzgl=16 i lp=580","rokwzgl=17 i lp=580","rokwzgl=18 i lp=580",{"$f":"+\"rokwzgl=\"&X$9&\" i lp=\"&$A66","v":"rokwzgl=19 i lp=580"},"rokwzgl=20 i lp=580","rokwzgl=21 i lp=580","rokwzgl=22 i lp=580","rokwzgl=23 i lp=580","rokwzgl=24 i lp=580","rokwzgl=25 i lp=580","rokwzgl=26 i lp=580","rokwzgl=27 i lp=580","rokwzgl=28 i lp=580","rokwzgl=29 i lp=580"]
[590,"11.2"," Wydatki związane z funkcjonowaniem organów jednostki samorządu terytorialnego","rokwzgl=0 i lp=590","rokwzgl=0 i lp=590","rokwzgl=1 i lp=590","rokwzgl=2 i lp=590","rokwzgl=3 i lp=590","rokwzgl=4 i lp=590","rokwzgl=5 i lp=590","rokwzgl=6 i lp=590","rokwzgl=7 i lp=590","rokwzgl=8 i lp=590","rokwzgl=9 i lp=590","rokwzgl=10 i lp=590","rokwzgl=11 i lp=590","rokwzgl=12 i lp=590","rokwzgl=13 i lp=590","rokwzgl=14 i lp=590","rokwzgl=15 i lp=590","rokwzgl=16 i lp=590","rokwzgl=17 i lp=590","rokwzgl=18 i lp=590","rokwzgl=19 i lp=590","rokwzgl=20 i lp=590","rokwzgl=21 i lp=590","rokwzgl=22 i lp=590","rokwzgl=23 i lp=590","rokwzgl=24 i lp=590","rokwzgl=25 i lp=590","rokwzgl=26 i lp=590","rokwzgl=27 i lp=590","rokwzgl=28 i lp=590","rokwzgl=29 i lp=590"]
[600,"11.3"," Wydatki objęte limitem, o którym mowa w art. 226 ust. 3 pkt 4 ustawy","rokwzgl=0 i lp=600","rokwzgl=0 i lp=600","rokwzgl=1 i lp=600","rokwzgl=2 i lp=600","rokwzgl=3 i lp=600","rokwzgl=4 i lp=600","rokwzgl=5 i lp=600","rokwzgl=6 i lp=600","rokwzgl=7 i lp=600","rokwzgl=8 i lp=600","rokwzgl=9 i lp=600","rokwzgl=10 i lp=600","rokwzgl=11 i lp=600","rokwzgl=12 i lp=600","rokwzgl=13 i lp=600","rokwzgl=14 i lp=600","rokwzgl=15 i lp=600","rokwzgl=16 i lp=600","rokwzgl=17 i lp=600","rokwzgl=18 i lp=600","rokwzgl=19 i lp=600","rokwzgl=20 i lp=600","rokwzgl=21 i lp=600","rokwzgl=22 i lp=600","rokwzgl=23 i lp=600","rokwzgl=24 i lp=600","rokwzgl=25 i lp=600","rokwzgl=26 i lp=600","rokwzgl=27 i lp=600","rokwzgl=28 i lp=600","rokwzgl=29 i lp=600"]
[610,"11.3.1","   bieżące","rokwzgl=0 i lp=610","rokwzgl=0 i lp=610","rokwzgl=1 i lp=610","rokwzgl=2 i lp=610","rokwzgl=3 i lp=610","rokwzgl=4 i lp=610","rokwzgl=5 i lp=610","rokwzgl=6 i lp=610","rokwzgl=7 i lp=610","rokwzgl=8 i lp=610","rokwzgl=9 i lp=610","rokwzgl=10 i lp=610","rokwzgl=11 i lp=610","rokwzgl=12 i lp=610","rokwzgl=13 i lp=610","rokwzgl=14 i lp=610","rokwzgl=15 i lp=610","rokwzgl=16 i lp=610","rokwzgl=17 i lp=610","rokwzgl=18 i lp=610","rokwzgl=19 i lp=610","rokwzgl=20 i lp=610","rokwzgl=21 i lp=610","rokwzgl=22 i lp=610","rokwzgl=23 i lp=610","rokwzgl=24 i lp=610","rokwzgl=25 i lp=610","rokwzgl=26 i lp=610","rokwzgl=27 i lp=610","rokwzgl=28 i lp=610","rokwzgl=29 i lp=610"]
[620,"11.3.2","   majątkowe","rokwzgl=0 i lp=620","rokwzgl=0 i lp=620","rokwzgl=1 i lp=620","rokwzgl=2 i lp=620","rokwzgl=3 i lp=620","rokwzgl=4 i lp=620","rokwzgl=5 i lp=620","rokwzgl=6 i lp=620","rokwzgl=7 i lp=620","rokwzgl=8 i lp=620","rokwzgl=9 i lp=620","rokwzgl=10 i lp=620","rokwzgl=11 i lp=620","rokwzgl=12 i lp=620","rokwzgl=13 i lp=620","rokwzgl=14 i lp=620","rokwzgl=15 i lp=620","rokwzgl=16 i lp=620","rokwzgl=17 i lp=620","rokwzgl=18 i lp=620","rokwzgl=19 i lp=620","rokwzgl=20 i lp=620","rokwzgl=21 i lp=620","rokwzgl=22 i lp=620","rokwzgl=23 i lp=620","rokwzgl=24 i lp=620","rokwzgl=25 i lp=620","rokwzgl=26 i lp=620","rokwzgl=27 i lp=620","rokwzgl=28 i lp=620","rokwzgl=29 i lp=620"]
[630,"11.4"," Wydatki inwestycyjne kontynuowane ","rokwzgl=0 i lp=630","rokwzgl=0 i lp=630","rokwzgl=1 i lp=630","rokwzgl=2 i lp=630","rokwzgl=3 i lp=630","rokwzgl=4 i lp=630","rokwzgl=5 i lp=630","rokwzgl=6 i lp=630","rokwzgl=7 i lp=630","rokwzgl=8 i lp=630","rokwzgl=9 i lp=630","rokwzgl=10 i lp=630","rokwzgl=11 i lp=630","rokwzgl=12 i lp=630","rokwzgl=13 i lp=630","rokwzgl=14 i lp=630","rokwzgl=15 i lp=630","rokwzgl=16 i lp=630","rokwzgl=17 i lp=630","rokwzgl=18 i lp=630","rokwzgl=19 i lp=630","rokwzgl=20 i lp=630","rokwzgl=21 i lp=630","rokwzgl=22 i lp=630","rokwzgl=23 i lp=630","rokwzgl=24 i lp=630","rokwzgl=25 i lp=630","rokwzgl=26 i lp=630","rokwzgl=27 i lp=630","rokwzgl=28 i lp=630","rokwzgl=29 i lp=630"]
[640,"11.5"," Nowe wydatki inwestycyjne","rokwzgl=0 i lp=640","rokwzgl=0 i lp=640","rokwzgl=1 i lp=640","rokwzgl=2 i lp=640","rokwzgl=3 i lp=640","rokwzgl=4 i lp=640","rokwzgl=5 i lp=640","rokwzgl=6 i lp=640","rokwzgl=7 i lp=640","rokwzgl=8 i lp=640","rokwzgl=9 i lp=640","rokwzgl=10 i lp=640","rokwzgl=11 i lp=640","rokwzgl=12 i lp=640","rokwzgl=13 i lp=640","rokwzgl=14 i lp=640","rokwzgl=15 i lp=640","rokwzgl=16 i lp=640","rokwzgl=17 i lp=640","rokwzgl=18 i lp=640","rokwzgl=19 i lp=640","rokwzgl=20 i lp=640","rokwzgl=21 i lp=640","rokwzgl=22 i lp=640","rokwzgl=23 i lp=640","rokwzgl=24 i lp=640","rokwzgl=25 i lp=640","rokwzgl=26 i lp=640","rokwzgl=27 i lp=640","rokwzgl=28 i lp=640","rokwzgl=29 i lp=640"]
[650,"11.6"," Wydatki majątkowe w formie dotacji ","rokwzgl=0 i lp=650","rokwzgl=0 i lp=650","rokwzgl=1 i lp=650","rokwzgl=2 i lp=650","rokwzgl=3 i lp=650","rokwzgl=4 i lp=650","rokwzgl=5 i lp=650","rokwzgl=6 i lp=650","rokwzgl=7 i lp=650","rokwzgl=8 i lp=650","rokwzgl=9 i lp=650","rokwzgl=10 i lp=650","rokwzgl=11 i lp=650","rokwzgl=12 i lp=650","rokwzgl=13 i lp=650","rokwzgl=14 i lp=650","rokwzgl=15 i lp=650","rokwzgl=16 i lp=650","rokwzgl=17 i lp=650","rokwzgl=18 i lp=650","rokwzgl=19 i lp=650","rokwzgl=20 i lp=650","rokwzgl=21 i lp=650","rokwzgl=22 i lp=650","rokwzgl=23 i lp=650","rokwzgl=24 i lp=650","rokwzgl=25 i lp=650","rokwzgl=26 i lp=650","rokwzgl=27 i lp=650","rokwzgl=28 i lp=650","rokwzgl=29 i lp=650"]
[660,12,"Finansowanie programów, projektów lub zadań realizowanych z udziałem środków, o których mowa w art. 5 ust. 1 pkt 2 i 3 ustawy","rokwzgl=0 i lp=660","rokwzgl=0 i lp=660","rokwzgl=1 i lp=660","rokwzgl=2 i lp=660","rokwzgl=3 i lp=660","rokwzgl=4 i lp=660","rokwzgl=5 i lp=660","rokwzgl=6 i lp=660","rokwzgl=7 i lp=660","rokwzgl=8 i lp=660","rokwzgl=9 i lp=660","rokwzgl=10 i lp=660","rokwzgl=11 i lp=660","rokwzgl=12 i lp=660","rokwzgl=13 i lp=660","rokwzgl=14 i lp=660","rokwzgl=15 i lp=660","rokwzgl=16 i lp=660","rokwzgl=17 i lp=660","rokwzgl=18 i lp=660","rokwzgl=19 i lp=660","rokwzgl=20 i lp=660","rokwzgl=21 i lp=660","rokwzgl=22 i lp=660","rokwzgl=23 i lp=660","rokwzgl=24 i lp=660","rokwzgl=25 i lp=660","rokwzgl=26 i lp=660","rokwzgl=27 i lp=660","rokwzgl=28 i lp=660","rokwzgl=29 i lp=660"]
[670,"12.1"," Dochody bieżące  na programy, projekty lub zadania finansowane z udziałem środków, o których mowa w art. 5 ust. 1 pkt 2 i 3 ustawy","rokwzgl=0 i lp=670","rokwzgl=0 i lp=670","rokwzgl=1 i lp=670","rokwzgl=2 i lp=670","rokwzgl=3 i lp=670","rokwzgl=4 i lp=670","rokwzgl=5 i lp=670","rokwzgl=6 i lp=670","rokwzgl=7 i lp=670","rokwzgl=8 i lp=670","rokwzgl=9 i lp=670","rokwzgl=10 i lp=670","rokwzgl=11 i lp=670","rokwzgl=12 i lp=670","rokwzgl=13 i lp=670","rokwzgl=14 i lp=670","rokwzgl=15 i lp=670","rokwzgl=16 i lp=670","rokwzgl=17 i lp=670","rokwzgl=18 i lp=670","rokwzgl=19 i lp=670","rokwzgl=20 i lp=670","rokwzgl=21 i lp=670","rokwzgl=22 i lp=670","rokwzgl=23 i lp=670","rokwzgl=24 i lp=670","rokwzgl=25 i lp=670","rokwzgl=26 i lp=670","rokwzgl=27 i lp=670","rokwzgl=28 i lp=670","rokwzgl=29 i lp=670"]
[680,"12.1.1","  -  w tym środki określone w art. 5 ust. 1 pkt 2 ustawy",{"$f":"+\"rokwzgl=\"&D$9&\" i lp=\"&$A76","v":"rokwzgl=0 i lp=680"},"rokwzgl=0 i lp=680","rokwzgl=1 i lp=680","rokwzgl=2 i lp=680","rokwzgl=3 i lp=680","rokwzgl=4 i lp=680","rokwzgl=5 i lp=680","rokwzgl=6 i lp=680","rokwzgl=7 i lp=680","rokwzgl=8 i lp=680","rokwzgl=9 i lp=680","rokwzgl=10 i lp=680","rokwzgl=11 i lp=680","rokwzgl=12 i lp=680","rokwzgl=13 i lp=680","rokwzgl=14 i lp=680","rokwzgl=15 i lp=680","rokwzgl=16 i lp=680","rokwzgl=17 i lp=680","rokwzgl=18 i lp=680","rokwzgl=19 i lp=680","rokwzgl=20 i lp=680","rokwzgl=21 i lp=680","rokwzgl=22 i lp=680","rokwzgl=23 i lp=680","rokwzgl=24 i lp=680","rokwzgl=25 i lp=680","rokwzgl=26 i lp=680","rokwzgl=27 i lp=680","rokwzgl=28 i lp=680",{"$f":"+\"rokwzgl=\"&AH$9&\" i lp=\"&$A76","v":"rokwzgl=29 i lp=680"}]
[690,"12.1.1.1","   - w tym środki określone w art. 5 ust. 1 pkt 2 ustawy wynikające wyłącznie z  zawartych umów na realizację programu, projektu lub zadania",{"$f":"+\"rokwzgl=\"&D$9&\" i lp=\"&$A77","v":"rokwzgl=0 i lp=690"},{"$f":"+\"rokwzgl=\"&E$9&\" i lp=\"&$A77","v":"rokwzgl=0 i lp=690"},{"$f":"+\"rokwzgl=\"&F$9&\" i lp=\"&$A77","v":"rokwzgl=1 i lp=690"},{"$f":"+\"rokwzgl=\"&G$9&\" i lp=\"&$A77","v":"rokwzgl=2 i lp=690"},{"$f":"+\"rokwzgl=\"&H$9&\" i lp=\"&$A77","v":"rokwzgl=3 i lp=690"},{"$f":"+\"rokwzgl=\"&I$9&\" i lp=\"&$A77","v":"rokwzgl=4 i lp=690"},"rokwzgl=5 i lp=690","rokwzgl=6 i lp=690","rokwzgl=7 i lp=690","rokwzgl=8 i lp=690","rokwzgl=9 i lp=690","rokwzgl=10 i lp=690","rokwzgl=11 i lp=690","rokwzgl=12 i lp=690","rokwzgl=13 i lp=690","rokwzgl=14 i lp=690","rokwzgl=15 i lp=690","rokwzgl=16 i lp=690","rokwzgl=17 i lp=690","rokwzgl=18 i lp=690","rokwzgl=19 i lp=690","rokwzgl=20 i lp=690","rokwzgl=21 i lp=690","rokwzgl=22 i lp=690","rokwzgl=23 i lp=690","rokwzgl=24 i lp=690","rokwzgl=25 i lp=690","rokwzgl=26 i lp=690","rokwzgl=27 i lp=690","rokwzgl=28 i lp=690","rokwzgl=29 i lp=690"]
[700,"12.2"," Dochody majątkowe  na programy, projekty lub zadania finansowane z udziałem środków, o których mowa w art. 5 ust. 1 pkt 2 i 3 ustawy",{"$f":"+\"rokwzgl=\"&D$9&\" i lp=\"&$A78","v":"rokwzgl=0 i lp=700"},"rokwzgl=0 i lp=700","rokwzgl=1 i lp=700","rokwzgl=2 i lp=700","rokwzgl=3 i lp=700","rokwzgl=4 i lp=700","rokwzgl=5 i lp=700","rokwzgl=6 i lp=700","rokwzgl=7 i lp=700","rokwzgl=8 i lp=700","rokwzgl=9 i lp=700","rokwzgl=10 i lp=700","rokwzgl=11 i lp=700","rokwzgl=12 i lp=700","rokwzgl=13 i lp=700","rokwzgl=14 i lp=700","rokwzgl=15 i lp=700","rokwzgl=16 i lp=700","rokwzgl=17 i lp=700","rokwzgl=18 i lp=700","rokwzgl=19 i lp=700","rokwzgl=20 i lp=700","rokwzgl=21 i lp=700","rokwzgl=22 i lp=700","rokwzgl=23 i lp=700","rokwzgl=24 i lp=700","rokwzgl=25 i lp=700","rokwzgl=26 i lp=700","rokwzgl=27 i lp=700","rokwzgl=28 i lp=700","rokwzgl=29 i lp=700"]
[710,"12.2.1","   -  w tym środki określone w art. 5 ust. 1 pkt 2 ustawy","rokwzgl=0 i lp=710","rokwzgl=0 i lp=710","rokwzgl=1 i lp=710","rokwzgl=2 i lp=710","rokwzgl=3 i lp=710","rokwzgl=4 i lp=710","rokwzgl=5 i lp=710","rokwzgl=6 i lp=710","rokwzgl=7 i lp=710","rokwzgl=8 i lp=710","rokwzgl=9 i lp=710","rokwzgl=10 i lp=710","rokwzgl=11 i lp=710","rokwzgl=12 i lp=710","rokwzgl=13 i lp=710","rokwzgl=14 i lp=710","rokwzgl=15 i lp=710","rokwzgl=16 i lp=710","rokwzgl=17 i lp=710","rokwzgl=18 i lp=710","rokwzgl=19 i lp=710","rokwzgl=20 i lp=710","rokwzgl=21 i lp=710","rokwzgl=22 i lp=710","rokwzgl=23 i lp=710","rokwzgl=24 i lp=710","rokwzgl=25 i lp=710","rokwzgl=26 i lp=710","rokwzgl=27 i lp=710","rokwzgl=28 i lp=710","rokwzgl=29 i lp=710"]
[720,"12.2.1.1","    - w tym środki określone w art. 5 ust. 1 pkt 2 ustawy wynikające wyłącznie z zawartych umów na realizację programu, projektu lub zadania","rokwzgl=0 i lp=720","rokwzgl=0 i lp=720","rokwzgl=1 i lp=720","rokwzgl=2 i lp=720","rokwzgl=3 i lp=720","rokwzgl=4 i lp=720","rokwzgl=5 i lp=720","rokwzgl=6 i lp=720","rokwzgl=7 i lp=720","rokwzgl=8 i lp=720","rokwzgl=9 i lp=720","rokwzgl=10 i lp=720","rokwzgl=11 i lp=720","rokwzgl=12 i lp=720","rokwzgl=13 i lp=720","rokwzgl=14 i lp=720","rokwzgl=15 i lp=720","rokwzgl=16 i lp=720","rokwzgl=17 i lp=720","rokwzgl=18 i lp=720","rokwzgl=19 i lp=720","rokwzgl=20 i lp=720","rokwzgl=21 i lp=720","rokwzgl=22 i lp=720","rokwzgl=23 i lp=720","rokwzgl=24 i lp=720","rokwzgl=25 i lp=720","rokwzgl=26 i lp=720","rokwzgl=27 i lp=720","rokwzgl=28 i lp=720","rokwzgl=29 i lp=720"]
[730,"12.3"," Wydatki bieżące na programy, projekty lub zadania finansowane z udziałem środków, o których mowa w art. 5 ust. 1 pkt 2 i 3 ustawy","rokwzgl=0 i lp=730","rokwzgl=0 i lp=730","rokwzgl=1 i lp=730","rokwzgl=2 i lp=730","rokwzgl=3 i lp=730","rokwzgl=4 i lp=730","rokwzgl=5 i lp=730","rokwzgl=6 i lp=730","rokwzgl=7 i lp=730","rokwzgl=8 i lp=730","rokwzgl=9 i lp=730","rokwzgl=10 i lp=730","rokwzgl=11 i lp=730","rokwzgl=12 i lp=730","rokwzgl=13 i lp=730","rokwzgl=14 i lp=730","rokwzgl=15 i lp=730","rokwzgl=16 i lp=730","rokwzgl=17 i lp=730","rokwzgl=18 i lp=730","rokwzgl=19 i lp=730","rokwzgl=20 i lp=730","rokwzgl=21 i lp=730","rokwzgl=22 i lp=730","rokwzgl=23 i lp=730","rokwzgl=24 i lp=730","rokwzgl=25 i lp=730","rokwzgl=26 i lp=730","rokwzgl=27 i lp=730","rokwzgl=28 i lp=730","rokwzgl=29 i lp=730"]
[740,"12.3.1","  -  w tym finansowane środkami określonymi w art. 5 ust. 1 pkt 2 ustawy ","rokwzgl=0 i lp=740","rokwzgl=0 i lp=740","rokwzgl=1 i lp=740","rokwzgl=2 i lp=740","rokwzgl=3 i lp=740","rokwzgl=4 i lp=740","rokwzgl=5 i lp=740","rokwzgl=6 i lp=740","rokwzgl=7 i lp=740","rokwzgl=8 i lp=740","rokwzgl=9 i lp=740","rokwzgl=10 i lp=740","rokwzgl=11 i lp=740","rokwzgl=12 i lp=740","rokwzgl=13 i lp=740","rokwzgl=14 i lp=740","rokwzgl=15 i lp=740","rokwzgl=16 i lp=740","rokwzgl=17 i lp=740","rokwzgl=18 i lp=740","rokwzgl=19 i lp=740","rokwzgl=20 i lp=740","rokwzgl=21 i lp=740","rokwzgl=22 i lp=740","rokwzgl=23 i lp=740","rokwzgl=24 i lp=740","rokwzgl=25 i lp=740","rokwzgl=26 i lp=740","rokwzgl=27 i lp=740","rokwzgl=28 i lp=740","rokwzgl=29 i lp=740"]
[750,"12.3.2","  Wydatki bieżące na realizację programu, projektu lub zadania wynikające wyłącznie z zawartych umów z podmiotem dysponującym środkami, o których mowa w art. 5 ust. 1 pkt 2 ustawy ","rokwzgl=0 i lp=750","rokwzgl=0 i lp=750","rokwzgl=1 i lp=750","rokwzgl=2 i lp=750","rokwzgl=3 i lp=750","rokwzgl=4 i lp=750","rokwzgl=5 i lp=750","rokwzgl=6 i lp=750","rokwzgl=7 i lp=750","rokwzgl=8 i lp=750","rokwzgl=9 i lp=750","rokwzgl=10 i lp=750","rokwzgl=11 i lp=750","rokwzgl=12 i lp=750","rokwzgl=13 i lp=750","rokwzgl=14 i lp=750","rokwzgl=15 i lp=750","rokwzgl=16 i lp=750","rokwzgl=17 i lp=750","rokwzgl=18 i lp=750","rokwzgl=19 i lp=750","rokwzgl=20 i lp=750","rokwzgl=21 i lp=750","rokwzgl=22 i lp=750","rokwzgl=23 i lp=750","rokwzgl=24 i lp=750","rokwzgl=25 i lp=750","rokwzgl=26 i lp=750","rokwzgl=27 i lp=750","rokwzgl=28 i lp=750","rokwzgl=29 i lp=750"]
[760,"12.4"," Wydatki majątkowe na programy, projekty lub zadania finansowane z udziałem środków, o których mowa w art. 5 ust. 1 pkt 2 i 3 ustawy","rokwzgl=0 i lp=760","rokwzgl=0 i lp=760","rokwzgl=1 i lp=760","rokwzgl=2 i lp=760","rokwzgl=3 i lp=760","rokwzgl=4 i lp=760","rokwzgl=5 i lp=760","rokwzgl=6 i lp=760","rokwzgl=7 i lp=760","rokwzgl=8 i lp=760","rokwzgl=9 i lp=760","rokwzgl=10 i lp=760","rokwzgl=11 i lp=760","rokwzgl=12 i lp=760","rokwzgl=13 i lp=760","rokwzgl=14 i lp=760","rokwzgl=15 i lp=760","rokwzgl=16 i lp=760","rokwzgl=17 i lp=760","rokwzgl=18 i lp=760","rokwzgl=19 i lp=760","rokwzgl=20 i lp=760","rokwzgl=21 i lp=760","rokwzgl=22 i lp=760","rokwzgl=23 i lp=760","rokwzgl=24 i lp=760","rokwzgl=25 i lp=760","rokwzgl=26 i lp=760","rokwzgl=27 i lp=760","rokwzgl=28 i lp=760","rokwzgl=29 i lp=760"]
[761,"12.4.1","  -  w tym finansowane środkami określonymi w art. 5 ust. 1 pkt 2 ustawy","rokwzgl=0 i lp=761","rokwzgl=0 i lp=761","rokwzgl=1 i lp=761","rokwzgl=2 i lp=761","rokwzgl=3 i lp=761","rokwzgl=4 i lp=761","rokwzgl=5 i lp=761","rokwzgl=6 i lp=761","rokwzgl=7 i lp=761","rokwzgl=8 i lp=761","rokwzgl=9 i lp=761","rokwzgl=10 i lp=761","rokwzgl=11 i lp=761","rokwzgl=12 i lp=761","rokwzgl=13 i lp=761","rokwzgl=14 i lp=761","rokwzgl=15 i lp=761","rokwzgl=16 i lp=761","rokwzgl=17 i lp=761","rokwzgl=18 i lp=761","rokwzgl=19 i lp=761","rokwzgl=20 i lp=761","rokwzgl=21 i lp=761","rokwzgl=22 i lp=761","rokwzgl=23 i lp=761","rokwzgl=24 i lp=761","rokwzgl=25 i lp=761","rokwzgl=26 i lp=761","rokwzgl=27 i lp=761","rokwzgl=28 i lp=761","rokwzgl=29 i lp=761"]
[762,"12.4.2","  Wydatki majątkowe na realizację programu, projektu lub zadania wynikające wyłącznie z zawartych umów z podmiotem dysponującym środkami, o których mowa w art. 5 ust. 1 pkt 2 ustawy ","rokwzgl=0 i lp=762","rokwzgl=0 i lp=762","rokwzgl=1 i lp=762","rokwzgl=2 i lp=762","rokwzgl=3 i lp=762","rokwzgl=4 i lp=762","rokwzgl=5 i lp=762","rokwzgl=6 i lp=762","rokwzgl=7 i lp=762","rokwzgl=8 i lp=762","rokwzgl=9 i lp=762","rokwzgl=10 i lp=762","rokwzgl=11 i lp=762","rokwzgl=12 i lp=762","rokwzgl=13 i lp=762","rokwzgl=14 i lp=762","rokwzgl=15 i lp=762","rokwzgl=16 i lp=762","rokwzgl=17 i lp=762","rokwzgl=18 i lp=762","rokwzgl=19 i lp=762","rokwzgl=20 i lp=762","rokwzgl=21 i lp=762","rokwzgl=22 i lp=762","rokwzgl=23 i lp=762","rokwzgl=24 i lp=762","rokwzgl=25 i lp=762","rokwzgl=26 i lp=762","rokwzgl=27 i lp=762","rokwzgl=28 i lp=762","rokwzgl=29 i lp=762"]
[763,"12.5"," Wydatki na wkład krajowy w związku z umową na realizację programu, projektu lub zadania finansowanego z udziałem środków, o których mowa w art. 5 ust. 1 pkt 2 ustawy bez względu na stopień finansowania tymi środkami ","rokwzgl=0 i lp=763","rokwzgl=0 i lp=763","rokwzgl=1 i lp=763","rokwzgl=2 i lp=763","rokwzgl=3 i lp=763","rokwzgl=4 i lp=763","rokwzgl=5 i lp=763","rokwzgl=6 i lp=763","rokwzgl=7 i lp=763","rokwzgl=8 i lp=763","rokwzgl=9 i lp=763","rokwzgl=10 i lp=763","rokwzgl=11 i lp=763","rokwzgl=12 i lp=763","rokwzgl=13 i lp=763","rokwzgl=14 i lp=763","rokwzgl=15 i lp=763","rokwzgl=16 i lp=763","rokwzgl=17 i lp=763","rokwzgl=18 i lp=763","rokwzgl=19 i lp=763","rokwzgl=20 i lp=763","rokwzgl=21 i lp=763","rokwzgl=22 i lp=763","rokwzgl=23 i lp=763","rokwzgl=24 i lp=763","rokwzgl=25 i lp=763","rokwzgl=26 i lp=763","rokwzgl=27 i lp=763","rokwzgl=28 i lp=763","rokwzgl=29 i lp=763"]
[764,"12.5.1","  w tym w związku z już zawartą umową na realizację programu, projektu lub zadania","rokwzgl=0 i lp=764","rokwzgl=0 i lp=764","rokwzgl=1 i lp=764","rokwzgl=2 i lp=764","rokwzgl=3 i lp=764","rokwzgl=4 i lp=764","rokwzgl=5 i lp=764","rokwzgl=6 i lp=764","rokwzgl=7 i lp=764","rokwzgl=8 i lp=764","rokwzgl=9 i lp=764","rokwzgl=10 i lp=764","rokwzgl=11 i lp=764","rokwzgl=12 i lp=764","rokwzgl=13 i lp=764","rokwzgl=14 i lp=764","rokwzgl=15 i lp=764","rokwzgl=16 i lp=764","rokwzgl=17 i lp=764","rokwzgl=18 i lp=764","rokwzgl=19 i lp=764","rokwzgl=20 i lp=764","rokwzgl=21 i lp=764","rokwzgl=22 i lp=764","rokwzgl=23 i lp=764","rokwzgl=24 i lp=764","rokwzgl=25 i lp=764","rokwzgl=26 i lp=764","rokwzgl=27 i lp=764","rokwzgl=28 i lp=764","rokwzgl=29 i lp=764"]
[765,"12.6"," Wydatki na wkład krajowy w związku z zawartą po dniu 1 stycznia 2013 r. umową na realizację programu, projektu lub zadania finansowanego w co najmniej 60% środkami, o których mowa w art. 5 ust. 1 pkt 2 ustawy","rokwzgl=0 i lp=765","rokwzgl=0 i lp=765","rokwzgl=1 i lp=765","rokwzgl=2 i lp=765","rokwzgl=3 i lp=765","rokwzgl=4 i lp=765","rokwzgl=5 i lp=765","rokwzgl=6 i lp=765","rokwzgl=7 i lp=765","rokwzgl=8 i lp=765","rokwzgl=9 i lp=765","rokwzgl=10 i lp=765","rokwzgl=11 i lp=765","rokwzgl=12 i lp=765","rokwzgl=13 i lp=765","rokwzgl=14 i lp=765","rokwzgl=15 i lp=765","rokwzgl=16 i lp=765","rokwzgl=17 i lp=765","rokwzgl=18 i lp=765","rokwzgl=19 i lp=765","rokwzgl=20 i lp=765","rokwzgl=21 i lp=765","rokwzgl=22 i lp=765","rokwzgl=23 i lp=765","rokwzgl=24 i lp=765","rokwzgl=25 i lp=765","rokwzgl=26 i lp=765","rokwzgl=27 i lp=765","rokwzgl=28 i lp=765","rokwzgl=29 i lp=765"]
[766,"12.6.1","  w tym w związku z już zawartą umową na realizację programu, projektu lub zadania","rokwzgl=0 i lp=766","rokwzgl=0 i lp=766","rokwzgl=1 i lp=766","rokwzgl=2 i lp=766","rokwzgl=3 i lp=766","rokwzgl=4 i lp=766","rokwzgl=5 i lp=766","rokwzgl=6 i lp=766","rokwzgl=7 i lp=766","rokwzgl=8 i lp=766","rokwzgl=9 i lp=766","rokwzgl=10 i lp=766","rokwzgl=11 i lp=766","rokwzgl=12 i lp=766","rokwzgl=13 i lp=766","rokwzgl=14 i lp=766","rokwzgl=15 i lp=766","rokwzgl=16 i lp=766","rokwzgl=17 i lp=766","rokwzgl=18 i lp=766","rokwzgl=19 i lp=766","rokwzgl=20 i lp=766","rokwzgl=21 i lp=766","rokwzgl=22 i lp=766","rokwzgl=23 i lp=766","rokwzgl=24 i lp=766","rokwzgl=25 i lp=766","rokwzgl=26 i lp=766","rokwzgl=27 i lp=766","rokwzgl=28 i lp=766","rokwzgl=29 i lp=766"]
[767,"12.7"," Przychody z tytułu kredytów, pożyczek, emisji papierów wartościowych powstające w związku z umową na realizację programu, projektu lub zadania finansowanego z udziałem środków, o których mowa w art. 5 ust. 1 pkt 2 ustawy bez względu na stopień finansowania tymi środkami ","rokwzgl=0 i lp=767","rokwzgl=0 i lp=767","rokwzgl=1 i lp=767","rokwzgl=2 i lp=767","rokwzgl=3 i lp=767","rokwzgl=4 i lp=767","rokwzgl=5 i lp=767","rokwzgl=6 i lp=767","rokwzgl=7 i lp=767","rokwzgl=8 i lp=767","rokwzgl=9 i lp=767","rokwzgl=10 i lp=767","rokwzgl=11 i lp=767","rokwzgl=12 i lp=767","rokwzgl=13 i lp=767","rokwzgl=14 i lp=767","rokwzgl=15 i lp=767","rokwzgl=16 i lp=767","rokwzgl=17 i lp=767","rokwzgl=18 i lp=767","rokwzgl=19 i lp=767","rokwzgl=20 i lp=767","rokwzgl=21 i lp=767","rokwzgl=22 i lp=767","rokwzgl=23 i lp=767","rokwzgl=24 i lp=767","rokwzgl=25 i lp=767","rokwzgl=26 i lp=767","rokwzgl=27 i lp=767","rokwzgl=28 i lp=767","rokwzgl=29 i lp=767"]
[768,"12.7.1","  w tym w związku z już zawartą umową na realizację programu, projektu lub zadania","rokwzgl=0 i lp=768","rokwzgl=0 i lp=768","rokwzgl=1 i lp=768","rokwzgl=2 i lp=768","rokwzgl=3 i lp=768","rokwzgl=4 i lp=768","rokwzgl=5 i lp=768","rokwzgl=6 i lp=768","rokwzgl=7 i lp=768","rokwzgl=8 i lp=768","rokwzgl=9 i lp=768","rokwzgl=10 i lp=768","rokwzgl=11 i lp=768","rokwzgl=12 i lp=768","rokwzgl=13 i lp=768","rokwzgl=14 i lp=768","rokwzgl=15 i lp=768","rokwzgl=16 i lp=768","rokwzgl=17 i lp=768","rokwzgl=18 i lp=768","rokwzgl=19 i lp=768","rokwzgl=20 i lp=768","rokwzgl=21 i lp=768","rokwzgl=22 i lp=768","rokwzgl=23 i lp=768","rokwzgl=24 i lp=768","rokwzgl=25 i lp=768","rokwzgl=26 i lp=768","rokwzgl=27 i lp=768","rokwzgl=28 i lp=768","rokwzgl=29 i lp=768"]
[769,"12.8"," Przychody z tytułu kredytów, pożyczek, emisji papierów wartościowych powstające w związku z zawartą po dniu 1 stycznia 2013 r. umową na realizację programu, projektu lub zadania finansowanego w co najmniej 60% środkami, o których mowa w art. 5 ust. 1 pkt 2 ustawy","rokwzgl=0 i lp=769","rokwzgl=0 i lp=769","rokwzgl=1 i lp=769","rokwzgl=2 i lp=769","rokwzgl=3 i lp=769","rokwzgl=4 i lp=769","rokwzgl=5 i lp=769","rokwzgl=6 i lp=769","rokwzgl=7 i lp=769","rokwzgl=8 i lp=769","rokwzgl=9 i lp=769","rokwzgl=10 i lp=769","rokwzgl=11 i lp=769","rokwzgl=12 i lp=769","rokwzgl=13 i lp=769","rokwzgl=14 i lp=769","rokwzgl=15 i lp=769","rokwzgl=16 i lp=769","rokwzgl=17 i lp=769","rokwzgl=18 i lp=769","rokwzgl=19 i lp=769","rokwzgl=20 i lp=769","rokwzgl=21 i lp=769","rokwzgl=22 i lp=769","rokwzgl=23 i lp=769","rokwzgl=24 i lp=769","rokwzgl=25 i lp=769","rokwzgl=26 i lp=769","rokwzgl=27 i lp=769","rokwzgl=28 i lp=769","rokwzgl=29 i lp=769"]
[770,"12.8.1","  w tym w związku z już zawartą umową na realizację programu, projektu lub zadania","rokwzgl=0 i lp=770","rokwzgl=0 i lp=770","rokwzgl=1 i lp=770","rokwzgl=2 i lp=770","rokwzgl=3 i lp=770","rokwzgl=4 i lp=770","rokwzgl=5 i lp=770","rokwzgl=6 i lp=770","rokwzgl=7 i lp=770","rokwzgl=8 i lp=770","rokwzgl=9 i lp=770","rokwzgl=10 i lp=770","rokwzgl=11 i lp=770","rokwzgl=12 i lp=770","rokwzgl=13 i lp=770","rokwzgl=14 i lp=770","rokwzgl=15 i lp=770","rokwzgl=16 i lp=770","rokwzgl=17 i lp=770","rokwzgl=18 i lp=770","rokwzgl=19 i lp=770","rokwzgl=20 i lp=770","rokwzgl=21 i lp=770","rokwzgl=22 i lp=770","rokwzgl=23 i lp=770","rokwzgl=24 i lp=770","rokwzgl=25 i lp=770","rokwzgl=26 i lp=770","rokwzgl=27 i lp=770","rokwzgl=28 i lp=770","rokwzgl=29 i lp=770"]
[790,13,"Kwoty dotyczące przejęcia i spłaty zobowiązań po samodzielnych publicznych zakładach opieki zdrowotnej oraz pokrycia ujemnego wyniku ","rokwzgl=0 i lp=790","rokwzgl=0 i lp=790","rokwzgl=1 i lp=790","rokwzgl=2 i lp=790","rokwzgl=3 i lp=790","rokwzgl=4 i lp=790","rokwzgl=5 i lp=790","rokwzgl=6 i lp=790","rokwzgl=7 i lp=790","rokwzgl=8 i lp=790","rokwzgl=9 i lp=790","rokwzgl=10 i lp=790","rokwzgl=11 i lp=790","rokwzgl=12 i lp=790","rokwzgl=13 i lp=790","rokwzgl=14 i lp=790","rokwzgl=15 i lp=790","rokwzgl=16 i lp=790","rokwzgl=17 i lp=790","rokwzgl=18 i lp=790","rokwzgl=19 i lp=790","rokwzgl=20 i lp=790","rokwzgl=21 i lp=790","rokwzgl=22 i lp=790","rokwzgl=23 i lp=790","rokwzgl=24 i lp=790","rokwzgl=25 i lp=790","rokwzgl=26 i lp=790","rokwzgl=27 i lp=790","rokwzgl=28 i lp=790","rokwzgl=29 i lp=790"]
[800,"13.1"," Kwota zobowiązań wynikających z przejęcia przez jednostkę samorządu terytorialnego zobowiązań po likwidowanych i przekształcanych samodzielnych zakładach opieki zdrowotnej","rokwzgl=0 i lp=800","rokwzgl=0 i lp=800","rokwzgl=1 i lp=800","rokwzgl=2 i lp=800","rokwzgl=3 i lp=800","rokwzgl=4 i lp=800","rokwzgl=5 i lp=800","rokwzgl=6 i lp=800","rokwzgl=7 i lp=800","rokwzgl=8 i lp=800","rokwzgl=9 i lp=800","rokwzgl=10 i lp=800","rokwzgl=11 i lp=800","rokwzgl=12 i lp=800","rokwzgl=13 i lp=800","rokwzgl=14 i lp=800","rokwzgl=15 i lp=800","rokwzgl=16 i lp=800","rokwzgl=17 i lp=800","rokwzgl=18 i lp=800","rokwzgl=19 i lp=800","rokwzgl=20 i lp=800","rokwzgl=21 i lp=800","rokwzgl=22 i lp=800","rokwzgl=23 i lp=800","rokwzgl=24 i lp=800","rokwzgl=25 i lp=800","rokwzgl=26 i lp=800","rokwzgl=27 i lp=800","rokwzgl=28 i lp=800","rokwzgl=29 i lp=800"]
[810,"13.2"," Dochody budżetowe z tytułu dotacji celowej z budżetu państwa, o której mowa w art. 196 ustawy z  dnia 15 kwietnia 2011 r.  o działalności leczniczej (Dz.U. Nr 112, poz. 654, z późn. zm.)","rokwzgl=0 i lp=810","rokwzgl=0 i lp=810","rokwzgl=1 i lp=810","rokwzgl=2 i lp=810","rokwzgl=3 i lp=810","rokwzgl=4 i lp=810","rokwzgl=5 i lp=810","rokwzgl=6 i lp=810","rokwzgl=7 i lp=810","rokwzgl=8 i lp=810","rokwzgl=9 i lp=810","rokwzgl=10 i lp=810","rokwzgl=11 i lp=810","rokwzgl=12 i lp=810","rokwzgl=13 i lp=810","rokwzgl=14 i lp=810","rokwzgl=15 i lp=810","rokwzgl=16 i lp=810","rokwzgl=17 i lp=810","rokwzgl=18 i lp=810","rokwzgl=19 i lp=810","rokwzgl=20 i lp=810","rokwzgl=21 i lp=810","rokwzgl=22 i lp=810","rokwzgl=23 i lp=810","rokwzgl=24 i lp=810","rokwzgl=25 i lp=810","rokwzgl=26 i lp=810","rokwzgl=27 i lp=810","rokwzgl=28 i lp=810","rokwzgl=29 i lp=810"]
[820,"13.3"," Wysokość zobowiązań podlegających umorzeniu, o którym mowa w art. 190 ustawy o działalności leczniczej","rokwzgl=0 i lp=820","rokwzgl=0 i lp=820","rokwzgl=1 i lp=820","rokwzgl=2 i lp=820","rokwzgl=3 i lp=820","rokwzgl=4 i lp=820","rokwzgl=5 i lp=820","rokwzgl=6 i lp=820","rokwzgl=7 i lp=820","rokwzgl=8 i lp=820","rokwzgl=9 i lp=820","rokwzgl=10 i lp=820","rokwzgl=11 i lp=820","rokwzgl=12 i lp=820","rokwzgl=13 i lp=820","rokwzgl=14 i lp=820","rokwzgl=15 i lp=820","rokwzgl=16 i lp=820","rokwzgl=17 i lp=820","rokwzgl=18 i lp=820","rokwzgl=19 i lp=820","rokwzgl=20 i lp=820","rokwzgl=21 i lp=820","rokwzgl=22 i lp=820","rokwzgl=23 i lp=820","rokwzgl=24 i lp=820","rokwzgl=25 i lp=820","rokwzgl=26 i lp=820","rokwzgl=27 i lp=820","rokwzgl=28 i lp=820","rokwzgl=29 i lp=820"]
[830,"13.4"," Wydatki na spłatę przejętych zobowiązań samodzielnego publicznego zakładu opieki zdrowotnej przekształconego na zasadach określonych w przepisach  o działalności leczniczej","rokwzgl=0 i lp=830","rokwzgl=0 i lp=830","rokwzgl=1 i lp=830","rokwzgl=2 i lp=830","rokwzgl=3 i lp=830","rokwzgl=4 i lp=830","rokwzgl=5 i lp=830","rokwzgl=6 i lp=830","rokwzgl=7 i lp=830","rokwzgl=8 i lp=830","rokwzgl=9 i lp=830","rokwzgl=10 i lp=830","rokwzgl=11 i lp=830","rokwzgl=12 i lp=830","rokwzgl=13 i lp=830","rokwzgl=14 i lp=830","rokwzgl=15 i lp=830","rokwzgl=16 i lp=830","rokwzgl=17 i lp=830","rokwzgl=18 i lp=830","rokwzgl=19 i lp=830","rokwzgl=20 i lp=830","rokwzgl=21 i lp=830","rokwzgl=22 i lp=830","rokwzgl=23 i lp=830","rokwzgl=24 i lp=830","rokwzgl=25 i lp=830","rokwzgl=26 i lp=830","rokwzgl=27 i lp=830","rokwzgl=28 i lp=830","rokwzgl=29 i lp=830"]
[840,"13.5"," Wydatki na spłatę przejętych zobowiązań samodzielnego publicznego zakładu opieki zdrowotnej likwidowanego na zasadach określonych w przepisach  o działalności leczniczej","rokwzgl=0 i lp=840","rokwzgl=0 i lp=840","rokwzgl=1 i lp=840","rokwzgl=2 i lp=840","rokwzgl=3 i lp=840","rokwzgl=4 i lp=840","rokwzgl=5 i lp=840","rokwzgl=6 i lp=840","rokwzgl=7 i lp=840","rokwzgl=8 i lp=840","rokwzgl=9 i lp=840","rokwzgl=10 i lp=840","rokwzgl=11 i lp=840","rokwzgl=12 i lp=840","rokwzgl=13 i lp=840","rokwzgl=14 i lp=840","rokwzgl=15 i lp=840","rokwzgl=16 i lp=840","rokwzgl=17 i lp=840","rokwzgl=18 i lp=840","rokwzgl=19 i lp=840",{"$f":"+\"rokwzgl=\"&Y$9&\" i lp=\"&$A100","v":"rokwzgl=20 i lp=840"},"rokwzgl=21 i lp=840","rokwzgl=22 i lp=840","rokwzgl=23 i lp=840","rokwzgl=24 i lp=840","rokwzgl=25 i lp=840","rokwzgl=26 i lp=840","rokwzgl=27 i lp=840","rokwzgl=28 i lp=840","rokwzgl=29 i lp=840"]
[850,"13.6"," Wydatki na spłatę zobowiązań samodzielnego publicznego zakładu opieki zdrowotnej przejętych do końca 2011 r. na podstawie przepisów o zakładach opieki zdrowotnej","rokwzgl=0 i lp=850","rokwzgl=0 i lp=850","rokwzgl=1 i lp=850","rokwzgl=2 i lp=850","rokwzgl=3 i lp=850","rokwzgl=4 i lp=850","rokwzgl=5 i lp=850","rokwzgl=6 i lp=850","rokwzgl=7 i lp=850","rokwzgl=8 i lp=850","rokwzgl=9 i lp=850","rokwzgl=10 i lp=850","rokwzgl=11 i lp=850","rokwzgl=12 i lp=850","rokwzgl=13 i lp=850","rokwzgl=14 i lp=850","rokwzgl=15 i lp=850","rokwzgl=16 i lp=850","rokwzgl=17 i lp=850","rokwzgl=18 i lp=850","rokwzgl=19 i lp=850","rokwzgl=20 i lp=850","rokwzgl=21 i lp=850","rokwzgl=22 i lp=850","rokwzgl=23 i lp=850","rokwzgl=24 i lp=850","rokwzgl=25 i lp=850","rokwzgl=26 i lp=850","rokwzgl=27 i lp=850","rokwzgl=28 i lp=850","rokwzgl=29 i lp=850"]
[860,"13.7"," Wydatki bieżące na pokrycie ujemnego wyniku finansowego samodzielnego publicznego zakładu opieki zdrowotnej","rokwzgl=0 i lp=860","rokwzgl=0 i lp=860","rokwzgl=1 i lp=860","rokwzgl=2 i lp=860","rokwzgl=3 i lp=860","rokwzgl=4 i lp=860","rokwzgl=5 i lp=860","rokwzgl=6 i lp=860","rokwzgl=7 i lp=860","rokwzgl=8 i lp=860","rokwzgl=9 i lp=860","rokwzgl=10 i lp=860","rokwzgl=11 i lp=860","rokwzgl=12 i lp=860","rokwzgl=13 i lp=860",{"$f":"+\"rokwzgl=\"&S$9&\" i lp=\"&$A102","v":"rokwzgl=14 i lp=860"},"rokwzgl=15 i lp=860","rokwzgl=16 i lp=860","rokwzgl=17 i lp=860","rokwzgl=18 i lp=860","rokwzgl=19 i lp=860","rokwzgl=20 i lp=860","rokwzgl=21 i lp=860","rokwzgl=22 i lp=860","rokwzgl=23 i lp=860","rokwzgl=24 i lp=860","rokwzgl=25 i lp=860","rokwzgl=26 i lp=860","rokwzgl=27 i lp=860","rokwzgl=28 i lp=860","rokwzgl=29 i lp=860"]
[870,14,"Dane uzupełniające o długu i jego spłacie",{"$f":"+\"rokwzgl=\"&D$9&\" i lp=\"&$A103","v":"rokwzgl=0 i lp=870"},"rokwzgl=0 i lp=870","rokwzgl=1 i lp=870","rokwzgl=2 i lp=870","rokwzgl=3 i lp=870","rokwzgl=4 i lp=870","rokwzgl=5 i lp=870","rokwzgl=6 i lp=870","rokwzgl=7 i lp=870","rokwzgl=8 i lp=870","rokwzgl=9 i lp=870","rokwzgl=10 i lp=870","rokwzgl=11 i lp=870","rokwzgl=12 i lp=870","rokwzgl=13 i lp=870","rokwzgl=14 i lp=870","rokwzgl=15 i lp=870","rokwzgl=16 i lp=870","rokwzgl=17 i lp=870","rokwzgl=18 i lp=870","rokwzgl=19 i lp=870","rokwzgl=20 i lp=870","rokwzgl=21 i lp=870","rokwzgl=22 i lp=870","rokwzgl=23 i lp=870","rokwzgl=24 i lp=870","rokwzgl=25 i lp=870","rokwzgl=26 i lp=870","rokwzgl=27 i lp=870","rokwzgl=28 i lp=870","rokwzgl=29 i lp=870"]
[880,"14.1"," Spłaty rat kapitałowych oraz wykup papierów wartościowych, o których mowa w pkt. 5.1., wynikające wyłącznie z tytułu zobowiązań już zaciągniętych","rokwzgl=0 i lp=880","rokwzgl=0 i lp=880","rokwzgl=1 i lp=880","rokwzgl=2 i lp=880","rokwzgl=3 i lp=880","rokwzgl=4 i lp=880","rokwzgl=5 i lp=880","rokwzgl=6 i lp=880","rokwzgl=7 i lp=880","rokwzgl=8 i lp=880","rokwzgl=9 i lp=880","rokwzgl=10 i lp=880","rokwzgl=11 i lp=880","rokwzgl=12 i lp=880","rokwzgl=13 i lp=880","rokwzgl=14 i lp=880","rokwzgl=15 i lp=880","rokwzgl=16 i lp=880","rokwzgl=17 i lp=880","rokwzgl=18 i lp=880","rokwzgl=19 i lp=880","rokwzgl=20 i lp=880","rokwzgl=21 i lp=880","rokwzgl=22 i lp=880","rokwzgl=23 i lp=880","rokwzgl=24 i lp=880","rokwzgl=25 i lp=880","rokwzgl=26 i lp=880","rokwzgl=27 i lp=880","rokwzgl=28 i lp=880","rokwzgl=29 i lp=880"]
[890,"14.2"," Kwota długu, którego planowana spłata dokona się z wydatków budżetu","rokwzgl=0 i lp=890","rokwzgl=0 i lp=890","rokwzgl=1 i lp=890","rokwzgl=2 i lp=890","rokwzgl=3 i lp=890","rokwzgl=4 i lp=890","rokwzgl=5 i lp=890","rokwzgl=6 i lp=890","rokwzgl=7 i lp=890","rokwzgl=8 i lp=890","rokwzgl=9 i lp=890","rokwzgl=10 i lp=890","rokwzgl=11 i lp=890","rokwzgl=12 i lp=890","rokwzgl=13 i lp=890","rokwzgl=14 i lp=890","rokwzgl=15 i lp=890","rokwzgl=16 i lp=890","rokwzgl=17 i lp=890","rokwzgl=18 i lp=890","rokwzgl=19 i lp=890","rokwzgl=20 i lp=890","rokwzgl=21 i lp=890","rokwzgl=22 i lp=890","rokwzgl=23 i lp=890","rokwzgl=24 i lp=890","rokwzgl=25 i lp=890","rokwzgl=26 i lp=890","rokwzgl=27 i lp=890","rokwzgl=28 i lp=890","rokwzgl=29 i lp=890"]
[900,"14.3"," Wydatki zmniejszające dług, w tym","rokwzgl=0 i lp=900","rokwzgl=0 i lp=900","rokwzgl=1 i lp=900","rokwzgl=2 i lp=900","rokwzgl=3 i lp=900","rokwzgl=4 i lp=900","rokwzgl=5 i lp=900","rokwzgl=6 i lp=900","rokwzgl=7 i lp=900","rokwzgl=8 i lp=900","rokwzgl=9 i lp=900","rokwzgl=10 i lp=900","rokwzgl=11 i lp=900","rokwzgl=12 i lp=900","rokwzgl=13 i lp=900","rokwzgl=14 i lp=900","rokwzgl=15 i lp=900","rokwzgl=16 i lp=900","rokwzgl=17 i lp=900","rokwzgl=18 i lp=900","rokwzgl=19 i lp=900","rokwzgl=20 i lp=900","rokwzgl=21 i lp=900","rokwzgl=22 i lp=900","rokwzgl=23 i lp=900","rokwzgl=24 i lp=900","rokwzgl=25 i lp=900","rokwzgl=26 i lp=900","rokwzgl=27 i lp=900","rokwzgl=28 i lp=900","rokwzgl=29 i lp=900"]
[910,"14.3.1","  spłata zobowiązań wymagalnych z lat poprzednich, innych niż w pkt 14.3.3","rokwzgl=0 i lp=910","rokwzgl=0 i lp=910","rokwzgl=1 i lp=910","rokwzgl=2 i lp=910","rokwzgl=3 i lp=910","rokwzgl=4 i lp=910","rokwzgl=5 i lp=910","rokwzgl=6 i lp=910","rokwzgl=7 i lp=910","rokwzgl=8 i lp=910","rokwzgl=9 i lp=910","rokwzgl=10 i lp=910","rokwzgl=11 i lp=910","rokwzgl=12 i lp=910","rokwzgl=13 i lp=910","rokwzgl=14 i lp=910","rokwzgl=15 i lp=910","rokwzgl=16 i lp=910","rokwzgl=17 i lp=910","rokwzgl=18 i lp=910","rokwzgl=19 i lp=910","rokwzgl=20 i lp=910","rokwzgl=21 i lp=910","rokwzgl=22 i lp=910","rokwzgl=23 i lp=910","rokwzgl=24 i lp=910","rokwzgl=25 i lp=910","rokwzgl=26 i lp=910","rokwzgl=27 i lp=910","rokwzgl=28 i lp=910","rokwzgl=29 i lp=910"]
[920,"14.3.2","  związane z umowami zaliczanymi do tytułów dłużnych wliczanych do państwowego długu publicznego","rokwzgl=0 i lp=920","rokwzgl=0 i lp=920","rokwzgl=1 i lp=920","rokwzgl=2 i lp=920","rokwzgl=3 i lp=920","rokwzgl=4 i lp=920","rokwzgl=5 i lp=920","rokwzgl=6 i lp=920","rokwzgl=7 i lp=920","rokwzgl=8 i lp=920","rokwzgl=9 i lp=920","rokwzgl=10 i lp=920","rokwzgl=11 i lp=920","rokwzgl=12 i lp=920","rokwzgl=13 i lp=920","rokwzgl=14 i lp=920","rokwzgl=15 i lp=920","rokwzgl=16 i lp=920","rokwzgl=17 i lp=920","rokwzgl=18 i lp=920","rokwzgl=19 i lp=920","rokwzgl=20 i lp=920","rokwzgl=21 i lp=920","rokwzgl=22 i lp=920","rokwzgl=23 i lp=920","rokwzgl=24 i lp=920","rokwzgl=25 i lp=920","rokwzgl=26 i lp=920","rokwzgl=27 i lp=920","rokwzgl=28 i lp=920","rokwzgl=29 i lp=920"]
[930,"14.3.3","  wypłaty z tytułu wymagalnych poręczeń i gwarancji","rokwzgl=0 i lp=930","rokwzgl=0 i lp=930","rokwzgl=1 i lp=930","rokwzgl=2 i lp=930","rokwzgl=3 i lp=930","rokwzgl=4 i lp=930","rokwzgl=5 i lp=930","rokwzgl=6 i lp=930","rokwzgl=7 i lp=930","rokwzgl=8 i lp=930","rokwzgl=9 i lp=930","rokwzgl=10 i lp=930","rokwzgl=11 i lp=930","rokwzgl=12 i lp=930","rokwzgl=13 i lp=930","rokwzgl=14 i lp=930","rokwzgl=15 i lp=930","rokwzgl=16 i lp=930","rokwzgl=17 i lp=930","rokwzgl=18 i lp=930","rokwzgl=19 i lp=930","rokwzgl=20 i lp=930","rokwzgl=21 i lp=930","rokwzgl=22 i lp=930","rokwzgl=23 i lp=930","rokwzgl=24 i lp=930","rokwzgl=25 i lp=930","rokwzgl=26 i lp=930","rokwzgl=27 i lp=930","rokwzgl=28 i lp=930","rokwzgl=29 i lp=930"]
[940,"14.4"," Wynik operacji niekasowych wpływających na kwotę długu ( m.in. umorzenia, różnice kursowe)","rokwzgl=0 i lp=940","rokwzgl=0 i lp=940","rokwzgl=1 i lp=940","rokwzgl=2 i lp=940","rokwzgl=3 i lp=940","rokwzgl=4 i lp=940","rokwzgl=5 i lp=940","rokwzgl=6 i lp=940","rokwzgl=7 i lp=940","rokwzgl=8 i lp=940","rokwzgl=9 i lp=940","rokwzgl=10 i lp=940","rokwzgl=11 i lp=940","rokwzgl=12 i lp=940","rokwzgl=13 i lp=940","rokwzgl=14 i lp=940","rokwzgl=15 i lp=940","rokwzgl=16 i lp=940","rokwzgl=17 i lp=940","rokwzgl=18 i lp=940","rokwzgl=19 i lp=940","rokwzgl=20 i lp=940","rokwzgl=21 i lp=940","rokwzgl=22 i lp=940","rokwzgl=23 i lp=940","rokwzgl=24 i lp=940","rokwzgl=25 i lp=940","rokwzgl=26 i lp=940","rokwzgl=27 i lp=940","rokwzgl=28 i lp=940","rokwzgl=29 i lp=940"]
[950,15,"Dane dotyczące emitowanych obligacji przychodowych","rokwzgl=0 i lp=950","rokwzgl=0 i lp=950","rokwzgl=1 i lp=950","rokwzgl=2 i lp=950","rokwzgl=3 i lp=950","rokwzgl=4 i lp=950","rokwzgl=5 i lp=950","rokwzgl=6 i lp=950","rokwzgl=7 i lp=950","rokwzgl=8 i lp=950","rokwzgl=9 i lp=950","rokwzgl=10 i lp=950","rokwzgl=11 i lp=950","rokwzgl=12 i lp=950","rokwzgl=13 i lp=950","rokwzgl=14 i lp=950","rokwzgl=15 i lp=950","rokwzgl=16 i lp=950","rokwzgl=17 i lp=950","rokwzgl=18 i lp=950","rokwzgl=19 i lp=950","rokwzgl=20 i lp=950","rokwzgl=21 i lp=950","rokwzgl=22 i lp=950","rokwzgl=23 i lp=950","rokwzgl=24 i lp=950","rokwzgl=25 i lp=950","rokwzgl=26 i lp=950","rokwzgl=27 i lp=950","rokwzgl=28 i lp=950","rokwzgl=29 i lp=950"]
[960,"15.1"," Środki z przedsięwzięcia gromadzone na rachunku bankowym,  w tym:","rokwzgl=0 i lp=960","rokwzgl=0 i lp=960","rokwzgl=1 i lp=960","rokwzgl=2 i lp=960","rokwzgl=3 i lp=960","rokwzgl=4 i lp=960","rokwzgl=5 i lp=960","rokwzgl=6 i lp=960","rokwzgl=7 i lp=960","rokwzgl=8 i lp=960","rokwzgl=9 i lp=960","rokwzgl=10 i lp=960","rokwzgl=11 i lp=960","rokwzgl=12 i lp=960","rokwzgl=13 i lp=960","rokwzgl=14 i lp=960","rokwzgl=15 i lp=960","rokwzgl=16 i lp=960","rokwzgl=17 i lp=960","rokwzgl=18 i lp=960","rokwzgl=19 i lp=960","rokwzgl=20 i lp=960","rokwzgl=21 i lp=960","rokwzgl=22 i lp=960","rokwzgl=23 i lp=960","rokwzgl=24 i lp=960","rokwzgl=25 i lp=960","rokwzgl=26 i lp=960","rokwzgl=27 i lp=960","rokwzgl=28 i lp=960","rokwzgl=29 i lp=960"]
[970,"15.1.1","  środki na zaspokojenie roszczeń obligatariuszy","rokwzgl=0 i lp=970","rokwzgl=0 i lp=970","rokwzgl=1 i lp=970","rokwzgl=2 i lp=970","rokwzgl=3 i lp=970","rokwzgl=4 i lp=970","rokwzgl=5 i lp=970","rokwzgl=6 i lp=970","rokwzgl=7 i lp=970","rokwzgl=8 i lp=970","rokwzgl=9 i lp=970","rokwzgl=10 i lp=970","rokwzgl=11 i lp=970","rokwzgl=12 i lp=970","rokwzgl=13 i lp=970","rokwzgl=14 i lp=970","rokwzgl=15 i lp=970","rokwzgl=16 i lp=970","rokwzgl=17 i lp=970","rokwzgl=18 i lp=970","rokwzgl=19 i lp=970","rokwzgl=20 i lp=970","rokwzgl=21 i lp=970","rokwzgl=22 i lp=970","rokwzgl=23 i lp=970","rokwzgl=24 i lp=970","rokwzgl=25 i lp=970","rokwzgl=26 i lp=970","rokwzgl=27 i lp=970","rokwzgl=28 i lp=970","rokwzgl=29 i lp=970"]
[980,"15.2"," Wydatki bieżące z tytułu świadczenia emitenta należnego obligatariuszom,  nieuwzględniane  w limicie spłaty zobowiązań, o którym mowa w art. 243 ustawy","rokwzgl=0 i lp=980","rokwzgl=0 i lp=980","rokwzgl=1 i lp=980","rokwzgl=2 i lp=980","rokwzgl=3 i lp=980","rokwzgl=4 i lp=980","rokwzgl=5 i lp=980","rokwzgl=6 i lp=980","rokwzgl=7 i lp=980","rokwzgl=8 i lp=980","rokwzgl=9 i lp=980","rokwzgl=10 i lp=980","rokwzgl=11 i lp=980","rokwzgl=12 i lp=980","rokwzgl=13 i lp=980","rokwzgl=14 i lp=980","rokwzgl=15 i lp=980","rokwzgl=16 i lp=980","rokwzgl=17 i lp=980","rokwzgl=18 i lp=980","rokwzgl=19 i lp=980","rokwzgl=20 i lp=980","rokwzgl=21 i lp=980","rokwzgl=22 i lp=980","rokwzgl=23 i lp=980","rokwzgl=24 i lp=980","rokwzgl=25 i lp=980","rokwzgl=26 i lp=980","rokwzgl=27 i lp=980","rokwzgl=28 i lp=980","rokwzgl=29 i lp=980"]

{"sheet":"rysunki","index":3,"n_rows":84,"n_cols":9,"rows_kept":84,"cut":false,"hidden":true,"merged":[]}
["Analiza graficzna danych z WPF",null,null,null,null,null,null,null,{"$f":"Zał.1_WPF_bazowy!#REF!&\" - \"&\"WPF za lata \"&Zał.1_WPF_bazowy!#REF!&\" - Nr Uchwały JST: \"&Zał.1_WPF_bazowy!#REF!","v":{"$error":"#REF!"}}]
[]
[]
[]
[]
[]
[]
[]
[]
[]
[]
[]
[]
[]
[]
[]
[]
[]
[]
[]
[]
[]
[]
[]
[]
[]
[]
[]
[]
[]
[]
[]
[]
[]
[]
[]
[]
[]
[]
[]
[]
[]
[]
[]
[]
[]
[]
[]
[]
[]
[]
[]
[]
[]
[]
[]
[]
[]
[]
[]
[]
[]
[]
[]
[]
[]
[null,"Rysunek z wskaźnikiem planistycznym",null,null,null,null,null,null,"Rysunek z wskaźnikiem planistycznym"]
[]
[]
[]
[]
[]
[]
[]
[]
[]
[]
[]
[]
[]
[]
[]
[]
[null,"Rysunek z wskaźnikiem wg wykonania",null,null,null,null,null,null,"Rysunek z wskaźnikiem wg wykonania"]

{"sheet":"DaneZrodlowe","index":4,"n_rows":984,"n_cols":17,"rows_kept":984,"cut":false,"hidden":true,"merged":[]}
["Wyciąg danych z tabeli \"Wieloletnia prognoza finansowa\" wprowadzonych do systemu BESTI@ z wybranej uchwały ",null,null,null,null,null,null,null,null,null,null,null,"Rok bazowy:",{"$f":"MIN(M:M)","v":2016},null,"Rok max",{"$f":"MAX(M:M)","v":2024}]
[]
["budzet","numer","nazwajst","kodgus","gt","mswia","lp","symbol","formula","wyszczegolnienie","wsk243","rokwzgl","rokprognozy","prognoza","DataPodjecia","DataWejscia"]
[2016,"1/2016","BRZEZINY",1021011,1,null,240,4.2,null," Wolne środki, o których mowa w art. 217 ust.2 pkt 6 ustawy",false,4,2020,0,"2016-01-28","2016-01-01"]
[2016,42370,"BRZEZINY",1021011,1,null,240,4.2,null," Wolne środki, o których mowa w art. 217 ust.2 pkt 6 ustawy",false,1,2017,0,"2016-01-28","2016-01-01"]
[2016,42370,"BRZEZINY",1021011,1,null,240,4.2,null," Wolne środki, o których mowa w art. 217 ust.2 pkt 6 ustawy",false,7,2023,0,"2016-01-28","2016-01-01"]
[2016,42370,"BRZEZINY",1021011,1,null,240,4.2,null," Wolne środki, o których mowa w art. 217 ust.2 pkt 6 ustawy",false,3,2019,0,"2016-01-28","2016-01-01"]
[2016,42370,"BRZEZINY",1021011,1,null,240,4.2,null," Wolne środki, o których mowa w art. 217 ust.2 pkt 6 ustawy",false,0,2016,0,"2016-01-28","2016-01-01"]
[2016,42370,"BRZEZINY",1021011,1,null,240,4.2,null," Wolne środki, o których mowa w art. 217 ust.2 pkt 6 ustawy",false,6,2022,0,"2016-01-28","2016-01-01"]
[2016,42370,"BRZEZINY",1021011,1,null,240,4.2,null," Wolne środki, o których mowa w art. 217 ust.2 pkt 6 ustawy",false,8,2024,0,"2016-01-28","2016-01-01"]
[2016,42370,"BRZEZINY",1021011,1,null,240,4.2,null," Wolne środki, o których mowa w art. 217 ust.2 pkt 6 ustawy",false,5,2021,0,"2016-01-28","2016-01-01"]
[2016,42370,"BRZEZINY",1021011,1,null,240,4.2,null," Wolne środki, o których mowa w art. 217 ust.2 pkt 6 ustawy",false,2,2018,0,"2016-01-28","2016-01-01"]
[2016,42370,"BRZEZINY",1021011,1,null,830,13.4,null," Wydatki na spłatę przejętych zobowiązań samodzielnego publicznego zakładu opieki zdrowotnej przekształconego na zasadach określonych w przepisach  o działalności leczniczej",true,0,2016,0,"2016-01-28","2016-01-01"]
[2016,42370,"BRZEZINY",1021011,1,null,830,13.4,null," Wydatki na spłatę przejętych zobowiązań samodzielnego publicznego zakładu opieki zdrowotnej przekształconego na zasadach określonych w przepisach  o działalności leczniczej",true,6,2022,0,"2016-01-28","2016-01-01"]
[2016,42370,"BRZEZINY",1021011,1,null,830,13.4,null," Wydatki na spłatę przejętych zobowiązań samodzielnego publicznego zakładu opieki zdrowotnej przekształconego na zasadach określonych w przepisach  o działalności leczniczej",true,8,2024,0,"2016-01-28","2016-01-01"]
[2016,42370,"BRZEZINY",1021011,1,null,830,13.4,null," Wydatki na spłatę przejętych zobowiązań samodzielnego publicznego zakładu opieki zdrowotnej przekształconego na zasadach określonych w przepisach  o działalności leczniczej",true,5,2021,0,"2016-01-28","2016-01-01"]
[2016,42370,"BRZEZINY",1021011,1,null,830,13.4,null," Wydatki na spłatę przejętych zobowiązań samodzielnego publicznego zakładu opieki zdrowotnej przekształconego na zasadach określonych w przepisach  o działalności leczniczej",true,3,2019,0,"2016-01-28","2016-01-01"]
[2016,42370,"BRZEZINY",1021011,1,null,830,13.4,null," Wydatki na spłatę przejętych zobowiązań samodzielnego publicznego zakładu opieki zdrowotnej przekształconego na zasadach określonych w przepisach  o działalności leczniczej",true,7,2023,0,"2016-01-28","2016-01-01"]
[2016,42370,"BRZEZINY",1021011,1,null,830,13.4,null," Wydatki na spłatę przejętych zobowiązań samodzielnego publicznego zakładu opieki zdrowotnej przekształconego na zasadach określonych w przepisach  o działalności leczniczej",true,1,2017,0,"2016-01-28","2016-01-01"]
[2016,42370,"BRZEZINY",1021011,1,null,830,13.4,null," Wydatki na spłatę przejętych zobowiązań samodzielnego publicznego zakładu opieki zdrowotnej przekształconego na zasadach określonych w przepisach  o działalności leczniczej",true,4,2020,0,"2016-01-28","2016-01-01"]
[2016,42370,"BRZEZINY",1021011,1,null,830,13.4,null," Wydatki na spłatę przejętych zobowiązań samodzielnego publicznego zakładu opieki zdrowotnej przekształconego na zasadach określonych w przepisach  o działalności leczniczej",true,2,2018,0,"2016-01-28","2016-01-01"]
[2016,42370,"BRZEZINY",1021011,1,null,600,11.3,"[11.3.1] + [11.3.2]"," Wydatki objęte limitem, o którym mowa w art. 226 ust. 3 pkt 4 ustawy",true,0,2016,847280,"2016-01-28","2016-01-01"]
[2016,42370,"BRZEZINY",1021011,1,null,600,11.3,"[11.3.1] + [11.3.2]"," Wydatki objęte limitem, o którym mowa w art. 226 ust. 3 pkt 4 ustawy",true,1,2017,1314520,"2016-01-28","2016-01-01"]
[2016,42370,"BRZEZINY",1021011,1,null,600,11.3,"[11.3.1] + [11.3.2]"," Wydatki objęte limitem, o którym mowa w art. 226 ust. 3 pkt 4 ustawy",true,5,2021,0,"2016-01-28","2016-01-01"]
[2016,42370,"BRZEZINY",1021011,1,null,600,11.3,"[11.3.1] + [11.3.2]"," Wydatki objęte limitem, o którym mowa w art. 226 ust. 3 pkt 4 ustawy",true,6,2022,0,"2016-01-28","2016-01-01"]
[2016,42370,"BRZEZINY",1021011,1,null,600,11.3,"[11.3.1] + [11.3.2]"," Wydatki objęte limitem, o którym mowa w art. 226 ust. 3 pkt 4 ustawy",true,4,2020,0,"2016-01-28","2016-01-01"]
[2016,42370,"BRZEZINY",1021011,1,null,600,11.3,"[11.3.1] + [11.3.2]"," Wydatki objęte limitem, o którym mowa w art. 226 ust. 3 pkt 4 ustawy",true,2,2018,600000,"2016-01-28","2016-01-01"]
[2016,42370,"BRZEZINY",1021011,1,null,600,11.3,"[11.3.1] + [11.3.2]"," Wydatki objęte limitem, o którym mowa w art. 226 ust. 3 pkt 4 ustawy",true,8,2024,0,"2016-01-28","2016-01-01"]
[2016,42370,"BRZEZINY",1021011,1,null,600,11.3,"[11.3.1] + [11.3.2]"," Wydatki objęte limitem, o którym mowa w art. 226 ust. 3 pkt 4 ustawy",true,3,2019,0,"2016-01-28","2016-01-01"]
[2016,42370,"BRZEZINY",1021011,1,null,600,11.3,"[11.3.1] + [11.3.2]"," Wydatki objęte limitem, o którym mowa w art. 226 ust. 3 pkt 4 ustawy",true,7,2023,0,"2016-01-28","2016-01-01"]
[2016,42370,"BRZEZINY",1021011,1,null,720,"12.2.1.1",null,"    - w tym środki określone w art. 5 ust. 1 pkt 2 ustawy wynikające wyłącznie z zawartych umów na realizację programu, projektu lub zadania",false,6,2022,0,"2016-01-28","2016-01-01"]
[2016,42370,"BRZEZINY",1021011,1,null,720,"12.2.1.1",null,"    - w tym środki określone w art. 5 ust. 1 pkt 2 ustawy wynikające wyłącznie z zawartych umów na realizację programu, projektu lub zadania",false,1,2017,0,"2016-01-28","2016-01-01"]
[2016,42370,"BRZEZINY",1021011,1,null,720,"12.2.1.1",null,"    - w tym środki określone w art. 5 ust. 1 pkt 2 ustawy wynikające wyłącznie z zawartych umów na realizację programu, projektu lub zadania",false,5,2021,0,"2016-01-28","2016-01-01"]
[2016,42370,"BRZEZINY",1021011,1,null,720,"12.2.1.1",null,"    - w tym środki określone w art. 5 ust. 1 pkt 2 ustawy wynikające wyłącznie z zawartych umów na realizację programu, projektu lub zadania",false,0,2016,0,"2016-01-28","2016-01-01"]
[2016,42370,"BRZEZINY",1021011,1,null,720,"12.2.1.1",null,"    - w tym środki określone w art. 5 ust. 1 pkt 2 ustawy wynikające wyłącznie z zawartych umów na realizację programu, projektu lub zadania",false,8,2024,0,"2016-01-28","2016-01-01"]
[2016,42370,"BRZEZINY",1021011,1,null,720,"12.2.1.1",null,"    - w tym środki określone w art. 5 ust. 1 pkt 2 ustawy wynikające wyłącznie z zawartych umów na realizację programu, projektu lub zadania",false,7,2023,0,"2016-01-28","2016-01-01"]
[2016,42370,"BRZEZINY",1021011,1,null,720,"12.2.1.1",null,"    - w tym środki określone w art. 5 ust. 1 pkt 2 ustawy wynikające wyłącznie z zawartych umów na realizację programu, projektu lub zadania",false,2,2018,0,"2016-01-28","2016-01-01"]
[2016,42370,"BRZEZINY",1021011,1,null,720,"12.2.1.1",null,"    - w tym środki określone w art. 5 ust. 1 pkt 2 ustawy wynikające wyłącznie z zawartych umów na realizację programu, projektu lub zadania",false,4,2020,0,"2016-01-28","2016-01-01"]
[2016,42370,"BRZEZINY",1021011,1,null,720,"12.2.1.1",null,"    - w tym środki określone w art. 5 ust. 1 pkt 2 ustawy wynikające wyłącznie z zawartych umów na realizację programu, projektu lub zadania",false,3,2019,0,"2016-01-28","2016-01-01"]
[2016,42370,"BRZEZINY",1021011,1,null,280,4.4000000000000004,null," Inne przychody niezwiązane z zaciągnięciem długu",false,5,2021,0,"2016-01-28","2016-01-01"]
[2016,42370,"BRZEZINY",1021011,1,null,280,4.4000000000000004,null," Inne przychody niezwiązane z zaciągnięciem długu",false,7,2023,0,"2016-01-28","2016-01-01"]
[2016,42370,"BRZEZINY",1021011,1,null,280,4.4000000000000004,null," Inne przychody niezwiązane z zaciągnięciem długu",false,2,2018,0,"2016-01-28","2016-01-01"]
[2016,42370,"BRZEZINY",1021011,1,null,280,4.4000000000000004,null," Inne przychody niezwiązane z zaciągnięciem długu",false,3,2019,0,"2016-01-28","2016-01-01"]
[2016,42370,"BRZEZINY",1021011,1,null,280,4.4000000000000004,null," Inne przychody niezwiązane z zaciągnięciem długu",false,6,2022,0,"2016-01-28","2016-01-01"]
[2016,42370,"BRZEZINY",1021011,1,null,280,4.4000000000000004,null," Inne przychody niezwiązane z zaciągnięciem długu",false,0,2016,0,"2016-01-28","2016-01-01"]
[2016,42370,"BRZEZINY",1021011,1,null,280,4.4000000000000004,null," Inne przychody niezwiązane z zaciągnięciem długu",false,8,2024,0,"2016-01-28","2016-01-01"]
[2016,42370,"BRZEZINY",1021011,1,null,280,4.4000000000000004,null," Inne przychody niezwiązane z zaciągnięciem długu",false,4,2020,0,"2016-01-28","2016-01-01"]
[2016,42370,"BRZEZINY",1021011,1,null,280,4.4000000000000004,null," Inne przychody niezwiązane z zaciągnięciem długu",false,1,2017,0,"2016-01-28","2016-01-01"]
[2016,42370,"BRZEZINY",1021011,1,null,40,"1.1.2",null,"  dochody z tytułu udziału we wpływach z podatku dochodowego od osób prawnych",true,3,2019,140000,"2016-01-28","2016-01-01"]
[2016,42370,"BRZEZINY",1021011,1,null,40,"1.1.2",null,"  dochody z tytułu udziału we wpływach z podatku dochodowego od osób prawnych",true,4,2020,0,"2016-01-28","2016-01-01"]
[2016,42370,"BRZEZINY",1021011,1,null,530,9.6999999999999993,"[9.6]-[9.4]"," Informacja o spełnieniu wskaźnika spłaty zobowiązań określonego w art. 243 ustawy, po uwzględnieniu zobowiązań związku współtworzonego przez jednostkę samorządu terytorialnego oraz po uwzględnieniu ustawowych wyłączeń, obliczonego w oparciu o plan 3 kwartałów roku poprzedzającego rok budżetowy",false,7,2023,635,"2016-01-28","2016-01-01"]
[2016,42370,"BRZEZINY",1021011,1,null,530,9.6999999999999993,"[9.6]-[9.4]"," Informacja o spełnieniu wskaźnika spłaty zobowiązań określonego w art. 243 ustawy, po uwzględnieniu zobowiązań związku współtworzonego przez jednostkę samorządu terytorialnego oraz po uwzględnieniu ustawowych wyłączeń, obliczonego w oparciu o plan 3 kwartałów roku poprzedzającego rok budżetowy",false,6,2022,539,"2016-01-28","2016-01-01"]
[2016,42370,"BRZEZINY",1021011,1,null,530,9.6999999999999993,"[9.6]-[9.4]"," Informacja o spełnieniu wskaźnika spłaty zobowiązań określonego w art. 243 ustawy, po uwzględnieniu zobowiązań związku współtworzonego przez jednostkę samorządu terytorialnego oraz po uwzględnieniu ustawowych wyłączeń, obliczonego w oparciu o plan 3 kwartałów roku poprzedzającego rok budżetowy",false,4,2020,245,"2016-01-28","2016-01-01"]
[2016,42370,"BRZEZINY",1021011,1,null,530,9.6999999999999993,"[9.6]-[9.4]"," Informacja o spełnieniu wskaźnika spłaty zobowiązań określonego w art. 243 ustawy, po uwzględnieniu zobowiązań związku współtworzonego przez jednostkę samorządu terytorialnego oraz po uwzględnieniu ustawowych wyłączeń, obliczonego w oparciu o plan 3 kwartałów roku poprzedzającego rok budżetowy",false,8,2024,522,"2016-01-28","2016-01-01"]
[2016,42370,"BRZEZINY",1021011,1,null,530,9.6999999999999993,"[9.6]-[9.4]"," Informacja o spełnieniu wskaźnika spłaty zobowiązań określonego w art. 243 ustawy, po uwzględnieniu zobowiązań związku współtworzonego przez jednostkę samorządu terytorialnego oraz po uwzględnieniu ustawowych wyłączeń, obliczonego w oparciu o plan 3 kwartałów roku poprzedzającego rok budżetowy",false,2,2018,36,"2016-01-28","2016-01-01"]
[2016,42370,"BRZEZINY",1021011,1,null,530,9.6999999999999993,"[9.6]-[9.4]"," Informacja o spełnieniu wskaźnika spłaty zobowiązań określonego w art. 243 ustawy, po uwzględnieniu zobowiązań związku współtworzonego przez jednostkę samorządu terytorialnego oraz po uwzględnieniu ustawowych wyłączeń, obliczonego w oparciu o plan 3 kwartałów roku poprzedzającego rok budżetowy",false,1,2017,40,"2016-01-28","2016-01-01"]
[2016,42370,"BRZEZINY",1021011,1,null,530,9.6999999999999993,"[9.6]-[9.4]"," Informacja o spełnieniu wskaźnika spłaty zobowiązań określonego w art. 243 ustawy, po uwzględnieniu zobowiązań związku współtworzonego przez jednostkę samorządu terytorialnego oraz po uwzględnieniu ustawowych wyłączeń, obliczonego w oparciu o plan 3 kwartałów roku poprzedzającego rok budżetowy",false,3,2019,179,"2016-01-28","2016-01-01"]
[2016,42370,"BRZEZINY",1021011,1,null,530,9.6999999999999993,"[9.6]-[9.4]"," Informacja o spełnieniu wskaźnika spłaty zobowiązań określonego w art. 243 ustawy, po uwzględnieniu zobowiązań związku współtworzonego przez jednostkę samorządu terytorialnego oraz po uwzględnieniu ustawowych wyłączeń, obliczonego w oparciu o plan 3 kwartałów roku poprzedzającego rok budżetowy",false,5,2021,400,"2016-01-28","2016-01-01"]
[2016,42370,"BRZEZINY",1021011,1,null,530,9.6999999999999993,"[9.6]-[9.4]"," Informacja o spełnieniu wskaźnika spłaty zobowiązań określonego w art. 243 ustawy, po uwzględnieniu zobowiązań związku współtworzonego przez jednostkę samorządu terytorialnego oraz po uwzględnieniu ustawowych wyłączeń, obliczonego w oparciu o plan 3 kwartałów roku poprzedzającego rok budżetowy",false,0,2016,70,"2016-01-28","2016-01-01"]
[2016,42370,"BRZEZINY",1021011,1,null,320,"5.1.1","[5.1.1.1] + [5.1.1.2] + [5.1.1.3]","  w tym łączna kwota przypadających na dany rok kwot ustawowych wyłączeń z limitu spłaty zobowiązań, o którym mowa w art. 243 ustawy, z tego:",true,8,2024,0,"2016-01-28","2016-01-01"]
[2016,42370,"BRZEZINY",1021011,1,null,320,"5.1.1","[5.1.1.1] + [5.1.1.2] + [5.1.1.3]","  w tym łączna kwota przypadających na dany rok kwot ustawowych wyłączeń z limitu spłaty zobowiązań, o którym mowa w art. 243 ustawy, z tego:",true,5,2021,0,"2016-01-28","2016-01-01"]
[2016,42370,"BRZEZINY",1021011,1,null,40,"1.1.2",null,"  dochody z tytułu udziału we wpływach z podatku dochodowego od osób prawnych",true,8,2024,0,"2016-01-28","2016-01-01"]
[2016,42370,"BRZEZINY",1021011,1,null,320,"5.1.1","[5.1.1.1] + [5.1.1.2] + [5.1.1.3]","  w tym łączna kwota przypadających na dany rok kwot ustawowych wyłączeń z limitu spłaty zobowiązań, o którym mowa w art. 243 ustawy, z tego:",true,0,2016,0,"2016-01-28","2016-01-01"]
[2016,42370,"BRZEZINY",1021011,1,null,320,"5.1.1","[5.1.1.1] + [5.1.1.2] + [5.1.1.3]","  w tym łączna kwota przypadających na dany rok kwot ustawowych wyłączeń z limitu spłaty zobowiązań, o którym mowa w art. 243 ustawy, z tego:",true,1,2017,0,"2016-01-28","2016-01-01"]
[2016,42370,"BRZEZINY",1021011,1,null,320,"5.1.1","[5.1.1.1] + [5.1.1.2] + [5.1.1.3]","  w tym łączna kwota przypadających na dany rok kwot ustawowych wyłączeń z limitu spłaty zobowiązań, o którym mowa w art. 243 ustawy, z tego:",true,3,2019,0,"2016-01-28","2016-01-01"]
[2016,42370,"BRZEZINY",1021011,1,null,320,"5.1.1","[5.1.1.1] + [5.1.1.2] + [5.1.1.3]","  w tym łączna kwota przypadających na dany rok kwot ustawowych wyłączeń z limitu spłaty zobowiązań, o którym mowa w art. 243 ustawy, z tego:",true,2,2018,0,"2016-01-28","2016-01-01"]
[2016,42370,"BRZEZINY",1021011,1,null,320,"5.1.1","[5.1.1.1] + [5.1.1.2] + [5.1.1.3]","  w tym łączna kwota przypadających na dany rok kwot ustawowych wyłączeń z limitu spłaty zobowiązań, o którym mowa w art. 243 ustawy, z tego:",true,7,2023,0,"2016-01-28","2016-01-01"]
[2016,42370,"BRZEZINY",1021011,1,null,320,"5.1.1","[5.1.1.1] + [5.1.1.2] + [5.1.1.3]","  w tym łączna kwota przypadających na dany rok kwot ustawowych wyłączeń z limitu spłaty zobowiązań, o którym mowa w art. 243 ustawy, z tego:",true,6,2022,0,"2016-01-28","2016-01-01"]
[2016,42370,"BRZEZINY",1021011,1,null,320,"5.1.1","[5.1.1.1] + [5.1.1.2] + [5.1.1.3]","  w tym łączna kwota przypadających na dany rok kwot ustawowych wyłączeń z limitu spłaty zobowiązań, o którym mowa w art. 243 ustawy, z tego:",true,4,2020,0,"2016-01-28","2016-01-01"]
[2016,42370,"BRZEZINY",1021011,1,null,880,14.1,null," Spłaty rat kapitałowych oraz wykup papierów wartościowych, o których mowa w pkt. 5.1., wynikające wyłącznie z tytułu zobowiązań już zaciągniętych",true,8,2024,1250000,"2016-01-28","2016-01-01"]
[2016,42370,"BRZEZINY",1021011,1,null,880,14.1,null," Spłaty rat kapitałowych oraz wykup papierów wartościowych, o których mowa w pkt. 5.1., wynikające wyłącznie z tytułu zobowiązań już zaciągniętych",true,7,2023,2418000,"2016-01-28","2016-01-01"]
[2016,42370,"BRZEZINY",1021011,1,null,880,14.1,null," Spłaty rat kapitałowych oraz wykup papierów wartościowych, o których mowa w pkt. 5.1., wynikające wyłącznie z tytułu zobowiązań już zaciągniętych",true,5,2021,2210004,"2016-01-28","2016-01-01"]
[2016,42370,"BRZEZINY",1021011,1,null,880,14.1,null," Spłaty rat kapitałowych oraz wykup papierów wartościowych, o których mowa w pkt. 5.1., wynikające wyłącznie z tytułu zobowiązań już zaciągniętych",true,2,2018,1678204,"2016-01-28","2016-01-01"]
[2016,42370,"BRZEZINY",1021011,1,null,880,14.1,null," Spłaty rat kapitałowych oraz wykup papierów wartościowych, o których mowa w pkt. 5.1., wynikające wyłącznie z tytułu zobowiązań już zaciągniętych",true,3,2019,1860004,"2016-01-28","2016-01-01"]
[2016,42370,"BRZEZINY",1021011,1,null,880,14.1,null," Spłaty rat kapitałowych oraz wykup papierów wartościowych, o których mowa w pkt. 5.1., wynikające wyłącznie z tytułu zobowiązań już zaciągniętych",true,1,2017,1478204,"2016-01-28","2016-01-01"]
[2016,42370,"BRZEZINY",1021011,1,null,880,14.1,null," Spłaty rat kapitałowych oraz wykup papierów wartościowych, o których mowa w pkt. 5.1., wynikające wyłącznie z tytułu zobowiązań już zaciągniętych",true,4,2020,2210004,"2016-01-28","2016-01-01"]
[2016,42370,"BRZEZINY",1021011,1,null,880,14.1,null," Spłaty rat kapitałowych oraz wykup papierów wartościowych, o których mowa w pkt. 5.1., wynikające wyłącznie z tytułu zobowiązań już zaciągniętych",true,0,2016,1215692,"2016-01-28","2016-01-01"]
[2016,42370,"BRZEZINY",1021011,1,null,880,14.1,null," Spłaty rat kapitałowych oraz wykup papierów wartościowych, o których mowa w pkt. 5.1., wynikające wyłącznie z tytułu zobowiązań już zaciągniętych",true,6,2022,2250004,"2016-01-28","2016-01-01"]
[2016,42370,"BRZEZINY",1021011,1,null,40,"1.1.2",null,"  dochody z tytułu udziału we wpływach z podatku dochodowego od osób prawnych",true,1,2017,140000,"2016-01-28","2016-01-01"]
[2016,42370,"BRZEZINY",1021011,1,null,40,"1.1.2",null,"  dochody z tytułu udziału we wpływach z podatku dochodowego od osób prawnych",true,6,2022,0,"2016-01-28","2016-01-01"]
[2016,42370,"BRZEZINY",1021011,1,null,40,"1.1.2",null,"  dochody z tytułu udziału we wpływach z podatku dochodowego od osób prawnych",true,0,2016,140000,"2016-01-28","2016-01-01"]
[2016,42370,"BRZEZINY",1021011,1,null,40,"1.1.2",null,"  dochody z tytułu udziału we wpływach z podatku dochodowego od osób prawnych",true,7,2023,0,"2016-01-28","2016-01-01"]
[2016,42370,"BRZEZINY",1021011,1,null,40,"1.1.2",null,"  dochody z tytułu udziału we wpływach z podatku dochodowego od osób prawnych",true,5,2021,0,"2016-01-28","2016-01-01"]
[2016,42370,"BRZEZINY",1021011,1,null,40,"1.1.2",null,"  dochody z tytułu udziału we wpływach z podatku dochodowego od osób prawnych",true,2,2018,140000,"2016-01-28","2016-01-01"]
[2016,42370,"BRZEZINY",1021011,1,null,766,"12.6.1",null,"  w tym w związku z już zawartą umową na realizację programu, projektu lub zadania",true,3,2019,0,"2016-01-28","2016-01-01"]
[2016,42370,"BRZEZINY",1021011,1,null,766,"12.6.1",null,"  w tym w związku z już zawartą umową na realizację programu, projektu lub zadania",true,7,2023,0,"2016-01-28","2016-01-01"]
[2016,42370,"BRZEZINY",1021011,1,null,766,"12.6.1",null,"  w tym w związku z już zawartą umową na realizację programu, projektu lub zadania",true,2,2018,0,"2016-01-28","2016-01-01"]
[2016,42370,"BRZEZINY",1021011,1,null,766,"12.6.1",null,"  w tym w związku z już zawartą umową na realizację programu, projektu lub zadania",true,0,2016,0,"2016-01-28","2016-01-01"]
[2016,42370,"BRZEZINY",1021011,1,null,766,"12.6.1",null,"  w tym w związku z już zawartą umową na realizację programu, projektu lub zadania",true,1,2017,0,"2016-01-28","2016-01-01"]
[2016,42370,"BRZEZINY",1021011,1,null,766,"12.6.1",null,"  w tym w związku z już zawartą umową na realizację programu, projektu lub zadania",true,6,2022,0,"2016-01-28","2016-01-01"]
[2016,42370,"BRZEZINY",1021011,1,null,766,"12.6.1",null,"  w tym w związku z już zawartą umową na realizację programu, projektu lub zadania",true,4,2020,0,"2016-01-28","2016-01-01"]
[2016,42370,"BRZEZINY",1021011,1,null,766,"12.6.1",null,"  w tym w związku z już zawartą umową na realizację programu, projektu lub zadania",true,5,2021,0,"2016-01-28","2016-01-01"]
[2016,42370,"BRZEZINY",1021011,1,null,766,"12.6.1",null,"  w tym w związku z już zawartą umową na realizację programu, projektu lub zadania",true,8,2024,0,"2016-01-28","2016-01-01"]
[2016,42370,"BRZEZINY",1021011,1,null,769,12.8,null," Przychody z tytułu kredytów, pożyczek, emisji papierów wartościowych powstające w związku z zawartą po dniu 1 stycznia 2013 r. umową na realizację programu, projektu lub zadania finansowanego w co najmniej 60% środkami, o których mowa w art. 5 ust. 1 pkt 2 ustawy",true,0,2016,0,"2016-01-28","2016-01-01"]
[2016,42370,"BRZEZINY",1021011,1,null,769,12.8,null," Przychody z tytułu kredytów, pożyczek, emisji papierów wartościowych powstające w związku z zawartą po dniu 1 stycznia 2013 r. umową na realizację programu, projektu lub zadania finansowanego w co najmniej 60% środkami, o których mowa w art. 5 ust. 1 pkt 2 ustawy",true,7,2023,0,"2016-01-28","2016-01-01"]
[2016,42370,"BRZEZINY",1021011,1,null,769,12.8,null," Przychody z tytułu kredytów, pożyczek, emisji papierów wartościowych powstające w związku z zawartą po dniu 1 stycznia 2013 r. umową na realizację programu, projektu lub zadania finansowanego w co najmniej 60% środkami, o których mowa w art. 5 ust. 1 pkt 2 ustawy",true,2,2018,0,"2016-01-28","2016-01-01"]
[2016,42370,"BRZEZINY",1021011,1,null,769,12.8,null," Przychody z tytułu kredytów, pożyczek, emisji papierów wartościowych powstające w związku z zawartą po dniu 1 stycznia 2013 r. umową na realizację programu, projektu lub zadania finansowanego w co najmniej 60% środkami, o których mowa w art. 5 ust. 1 pkt 2 ustawy",true,6,2022,0,"2016-01-28","2016-01-01"]
[2016,42370,"BRZEZINY",1021011,1,null,769,12.8,null," Przychody z tytułu kredytów, pożyczek, emisji papierów wartościowych powstające w związku z zawartą po dniu 1 stycznia 2013 r. umową na realizację programu, projektu lub zadania finansowanego w co najmniej 60% środkami, o których mowa w art. 5 ust. 1 pkt 2 ustawy",true,3,2019,0,"2016-01-28","2016-01-01"]
[2016,42370,"BRZEZINY",1021011,1,null,769,12.8,null," Przychody z tytułu kredytów, pożyczek, emisji papierów wartościowych powstające w związku z zawartą po dniu 1 stycznia 2013 r. umową na realizację programu, projektu lub zadania finansowanego w co najmniej 60% środkami, o których mowa w art. 5 ust. 1 pkt 2 ustawy",true,8,2024,0,"2016-01-28","2016-01-01"]
[2016,42370,"BRZEZINY",1021011,1,null,920,"14.3.2",null,"  związane z umowami zaliczanymi do tytułów dłużnych wliczanych do państwowego długu publicznego",true,1,2017,0,"2016-01-28","2016-01-01"]
[2016,42370,"BRZEZINY",1021011,1,null,769,12.8,null," Przychody z tytułu kredytów, pożyczek, emisji papierów wartościowych powstające w związku z zawartą po dniu 1 stycznia 2013 r. umową na realizację programu, projektu lub zadania finansowanego w co najmniej 60% środkami, o których mowa w art. 5 ust. 1 pkt 2 ustawy",true,4,2020,0,"2016-01-28","2016-01-01"]
[2016,42370,"BRZEZINY",1021011,1,null,769,12.8,null," Przychody z tytułu kredytów, pożyczek, emisji papierów wartościowych powstające w związku z zawartą po dniu 1 stycznia 2013 r. umową na realizację programu, projektu lub zadania finansowanego w co najmniej 60% środkami, o których mowa w art. 5 ust. 1 pkt 2 ustawy",true,5,2021,0,"2016-01-28","2016-01-01"]
[2016,42370,"BRZEZINY",1021011,1,null,769,12.8,null," Przychody z tytułu kredytów, pożyczek, emisji papierów wartościowych powstające w związku z zawartą po dniu 1 stycznia 2013 r. umową na realizację programu, projektu lub zadania finansowanego w co najmniej 60% środkami, o których mowa w art. 5 ust. 1 pkt 2 ustawy",true,1,2017,0,"2016-01-28","2016-01-01"]
[2016,42370,"BRZEZINY",1021011,1,null,150,"2.1.1.1",null,"   w tym: gwarancje i poręczenia podlegające wyłączeniu z limitu spłaty zobowiązań, o którym mowa w art. 243 ustawy",true,4,2020,0,"2016-01-28","2016-01-01"]
[2016,42370,"BRZEZINY",1021011,1,null,150,"2.1.1.1",null,"   w tym: gwarancje i poręczenia podlegające wyłączeniu z limitu spłaty zobowiązań, o którym mowa w art. 243 ustawy",true,5,2021,0,"2016-01-28","2016-01-01"]
[2016,42370,"BRZEZINY",1021011,1,null,150,"2.1.1.1",null,"   w tym: gwarancje i poręczenia podlegające wyłączeniu z limitu spłaty zobowiązań, o którym mowa w art. 243 ustawy",true,7,2023,0,"2016-01-28","2016-01-01"]
[2016,42370,"BRZEZINY",1021011,1,null,150,"2.1.1.1",null,"   w tym: gwarancje i poręczenia podlegające wyłączeniu z limitu spłaty zobowiązań, o którym mowa w art. 243 ustawy",true,8,2024,0,"2016-01-28","2016-01-01"]
[2016,42370,"BRZEZINY",1021011,1,null,150,"2.1.1.1",null,"   w tym: gwarancje i poręczenia podlegające wyłączeniu z limitu spłaty zobowiązań, o którym mowa w art. 243 ustawy",true,3,2019,0,"2016-01-28","2016-01-01"]
[2016,42370,"BRZEZINY",1021011,1,null,150,"2.1.1.1",null,"   w tym: gwarancje i poręczenia podlegające wyłączeniu z limitu spłaty zobowiązań, o którym mowa w art. 243 ustawy",true,2,2018,0,"2016-01-28","2016-01-01"]
[2016,42370,"BRZEZINY",1021011,1,null,150,"2.1.1.1",null,"   w tym: gwarancje i poręczenia podlegające wyłączeniu z limitu spłaty zobowiązań, o którym mowa w art. 243 ustawy",true,0,2016,0,"2016-01-28","2016-01-01"]
[2016,42370,"BRZEZINY",1021011,1,null,150,"2.1.1.1",null,"   w tym: gwarancje i poręczenia podlegające wyłączeniu z limitu spłaty zobowiązań, o którym mowa w art. 243 ustawy",true,1,2017,0,"2016-01-28","2016-01-01"]
[2016,42370,"BRZEZINY",1021011,1,null,150,"2.1.1.1",null,"   w tym: gwarancje i poręczenia podlegające wyłączeniu z limitu spłaty zobowiązań, o którym mowa w art. 243 ustawy",true,6,2022,0,"2016-01-28","2016-01-01"]
[2016,42370,"BRZEZINY",1021011,1,null,920,"14.3.2",null,"  związane z umowami zaliczanymi do tytułów dłużnych wliczanych do państwowego długu publicznego",true,3,2019,0,"2016-01-28","2016-01-01"]
[2016,42370,"BRZEZINY",1021011,1,null,920,"14.3.2",null,"  związane z umowami zaliczanymi do tytułów dłużnych wliczanych do państwowego długu publicznego",true,4,2020,0,"2016-01-28","2016-01-01"]
[2016,42370,"BRZEZINY",1021011,1,null,920,"14.3.2",null,"  związane z umowami zaliczanymi do tytułów dłużnych wliczanych do państwowego długu publicznego",true,6,2022,0,"2016-01-28","2016-01-01"]
[2016,42370,"BRZEZINY",1021011,1,null,920,"14.3.2",null,"  związane z umowami zaliczanymi do tytułów dłużnych wliczanych do państwowego długu publicznego",true,5,2021,0,"2016-01-28","2016-01-01"]
[2016,42370,"BRZEZINY",1021011,1,null,920,"14.3.2",null,"  związane z umowami zaliczanymi do tytułów dłużnych wliczanych do państwowego długu publicznego",true,0,2016,0,"2016-01-28","2016-01-01"]
[2016,42370,"BRZEZINY",1021011,1,null,920,"14.3.2",null,"  związane z umowami zaliczanymi do tytułów dłużnych wliczanych do państwowego długu publicznego",true,7,2023,0,"2016-01-28","2016-01-01"]
[2016,42370,"BRZEZINY",1021011,1,null,920,"14.3.2",null,"  związane z umowami zaliczanymi do tytułów dłużnych wliczanych do państwowego długu publicznego",true,8,2024,0,"2016-01-28","2016-01-01"]
[2016,42370,"BRZEZINY",1021011,1,null,920,"14.3.2",null,"  związane z umowami zaliczanymi do tytułów dłużnych wliczanych do państwowego długu publicznego",true,2,2018,0,"2016-01-28","2016-01-01"]
[2016,42370,"BRZEZINY",1021011,1,null,800,13.1,null," Kwota zobowiązań wynikających z przejęcia przez jednostkę samorządu terytorialnego zobowiązań po likwidowanych i przekształcanych samodzielnych zakładach opieki zdrowotnej",true,1,2017,0,"2016-01-28","2016-01-01"]
[2016,42370,"BRZEZINY",1021011,1,null,800,13.1,null," Kwota zobowiązań wynikających z przejęcia przez jednostkę samorządu terytorialnego zobowiązań po likwidowanych i przekształcanych samodzielnych zakładach opieki zdrowotnej",true,8,2024,0,"2016-01-28","2016-01-01"]
[2016,42370,"BRZEZINY",1021011,1,null,800,13.1,null," Kwota zobowiązań wynikających z przejęcia przez jednostkę samorządu terytorialnego zobowiązań po likwidowanych i przekształcanych samodzielnych zakładach opieki zdrowotnej",true,6,2022,0,"2016-01-28","2016-01-01"]
[2016,42370,"BRZEZINY",1021011,1,null,800,13.1,null," Kwota zobowiązań wynikających z przejęcia przez jednostkę samorządu terytorialnego zobowiązań po likwidowanych i przekształcanych samodzielnych zakładach opieki zdrowotnej",true,2,2018,0,"2016-01-28","2016-01-01"]
[2016,42370,"BRZEZINY",1021011,1,null,800,13.1,null," Kwota zobowiązań wynikających z przejęcia przez jednostkę samorządu terytorialnego zobowiązań po likwidowanych i przekształcanych samodzielnych zakładach opieki zdrowotnej",true,3,2019,0,"2016-01-28","2016-01-01"]
[2016,42370,"BRZEZINY",1021011,1,null,800,13.1,null," Kwota zobowiązań wynikających z przejęcia przez jednostkę samorządu terytorialnego zobowiązań po likwidowanych i przekształcanych samodzielnych zakładach opieki zdrowotnej",true,0,2016,0,"2016-01-28","2016-01-01"]
[2016,42370,"BRZEZINY",1021011,1,null,800,13.1,null," Kwota zobowiązań wynikających z przejęcia przez jednostkę samorządu terytorialnego zobowiązań po likwidowanych i przekształcanych samodzielnych zakładach opieki zdrowotnej",true,4,2020,0,"2016-01-28","2016-01-01"]
[2016,42370,"BRZEZINY",1021011,1,null,800,13.1,null," Kwota zobowiązań wynikających z przejęcia przez jednostkę samorządu terytorialnego zobowiązań po likwidowanych i przekształcanych samodzielnych zakładach opieki zdrowotnej",true,7,2023,0,"2016-01-28","2016-01-01"]
[2016,42370,"BRZEZINY",1021011,1,null,800,13.1,null," Kwota zobowiązań wynikających z przejęcia przez jednostkę samorządu terytorialnego zobowiązań po likwidowanych i przekształcanych samodzielnych zakładach opieki zdrowotnej",true,5,2021,0,"2016-01-28","2016-01-01"]
[2016,42370,"BRZEZINY",1021011,1,null,440,9,null,"Wskaźnik spłaty zobowiązań",false,0,2016,0,"2016-01-28","2016-01-01"]
[2016,42370,"BRZEZINY",1021011,1,null,440,9,null,"Wskaźnik spłaty zobowiązań",false,4,2020,0,"2016-01-28","2016-01-01"]
[2016,42370,"BRZEZINY",1021011,1,null,440,9,null,"Wskaźnik spłaty zobowiązań",false,5,2021,0,"2016-01-28","2016-01-01"]
[2016,42370,"BRZEZINY",1021011,1,null,440,9,null,"Wskaźnik spłaty zobowiązań",false,3,2019,0,"2016-01-28","2016-01-01"]
[2016,42370,"BRZEZINY",1021011,1,null,440,9,null,"Wskaźnik spłaty zobowiązań",false,7,2023,0,"2016-01-28","2016-01-01"]
[2016,42370,"BRZEZINY",1021011,1,null,440,9,null,"Wskaźnik spłaty zobowiązań",false,8,2024,0,"2016-01-28","2016-01-01"]
[2016,42370,"BRZEZINY",1021011,1,null,440,9,null,"Wskaźnik spłaty zobowiązań",false,1,2017,0,"2016-01-28","2016-01-01"]
[2016,42370,"BRZEZINY",1021011,1,null,440,9,null,"Wskaźnik spłaty zobowiązań",false,2,2018,0,"2016-01-28","2016-01-01"]
[2016,42370,"BRZEZINY",1021011,1,null,440,9,null,"Wskaźnik spłaty zobowiązań",false,6,2022,0,"2016-01-28","2016-01-01"]
[2016,42370,"BRZEZINY",1021011,1,null,490,9.3000000000000007,null," Kwota zobowiązań związku współtworzonego przez jednostkę samorządu terytorialnego przypadających do spłaty w danym roku budżetowym, podlegająca doliczeniu zgodnie z art. 244 ustawy",true,4,2020,0,"2016-01-28","2016-01-01"]
[2016,42370,"BRZEZINY",1021011,1,null,490,9.3000000000000007,null," Kwota zobowiązań związku współtworzonego przez jednostkę samorządu terytorialnego przypadających do spłaty w danym roku budżetowym, podlegająca doliczeniu zgodnie z art. 244 ustawy",true,3,2019,0,"2016-01-28","2016-01-01"]
[2016,42370,"BRZEZINY",1021011,1,null,490,9.3000000000000007,null," Kwota zobowiązań związku współtworzonego przez jednostkę samorządu terytorialnego przypadających do spłaty w danym roku budżetowym, podlegająca doliczeniu zgodnie z art. 244 ustawy",true,8,2024,0,"2016-01-28","2016-01-01"]
[2016,42370,"BRZEZINY",1021011,1,null,490,9.3000000000000007,null," Kwota zobowiązań związku współtworzonego przez jednostkę samorządu terytorialnego przypadających do spłaty w danym roku budżetowym, podlegająca doliczeniu zgodnie z art. 244 ustawy",true,5,2021,0,"2016-01-28","2016-01-01"]
[2016,42370,"BRZEZINY",1021011,1,null,490,9.3000000000000007,null," Kwota zobowiązań związku współtworzonego przez jednostkę samorządu terytorialnego przypadających do spłaty w danym roku budżetowym, podlegająca doliczeniu zgodnie z art. 244 ustawy",true,6,2022,0,"2016-01-28","2016-01-01"]
[2016,42370,"BRZEZINY",1021011,1,null,490,9.3000000000000007,null," Kwota zobowiązań związku współtworzonego przez jednostkę samorządu terytorialnego przypadających do spłaty w danym roku budżetowym, podlegająca doliczeniu zgodnie z art. 244 ustawy",true,2,2018,0,"2016-01-28","2016-01-01"]
[2016,42370,"BRZEZINY",1021011,1,null,490,9.3000000000000007,null," Kwota zobowiązań związku współtworzonego przez jednostkę samorządu terytorialnego przypadających do spłaty w danym roku budżetowym, podlegająca doliczeniu zgodnie z art. 244 ustawy",true,0,2016,0,"2016-01-28","2016-01-01"]
[2016,42370,"BRZEZINY",1021011,1,null,490,9.3000000000000007,null," Kwota zobowiązań związku współtworzonego przez jednostkę samorządu terytorialnego przypadających do spłaty w danym roku budżetowym, podlegająca doliczeniu zgodnie z art. 244 ustawy",true,1,2017,0,"2016-01-28","2016-01-01"]
[2016,42370,"BRZEZINY",1021011,1,null,490,9.3000000000000007,null," Kwota zobowiązań związku współtworzonego przez jednostkę samorządu terytorialnego przypadających do spłaty w danym roku budżetowym, podlegająca doliczeniu zgodnie z art. 244 ustawy",true,7,2023,0,"2016-01-28","2016-01-01"]
[2016,42370,"BRZEZINY",1021011,1,null,110,"1.2.2",null,"  z tytułu dotacji oraz środków przeznaczonych na inwestycje",true,4,2020,0,"2016-01-28","2016-01-01"]
[2016,42370,"BRZEZINY",1021011,1,null,110,"1.2.2",null,"  z tytułu dotacji oraz środków przeznaczonych na inwestycje",true,7,2023,0,"2016-01-28","2016-01-01"]
[2016,42370,"BRZEZINY",1021011,1,null,110,"1.2.2",null,"  z tytułu dotacji oraz środków przeznaczonych na inwestycje",true,3,2019,0,"2016-01-28","2016-01-01"]
[2016,42370,"BRZEZINY",1021011,1,null,110,"1.2.2",null,"  z tytułu dotacji oraz środków przeznaczonych na inwestycje",true,5,2021,0,"2016-01-28","2016-01-01"]
[2016,42370,"BRZEZINY",1021011,1,null,110,"1.2.2",null,"  z tytułu dotacji oraz środków przeznaczonych na inwestycje",true,6,2022,0,"2016-01-28","2016-01-01"]
[2016,42370,"BRZEZINY",1021011,1,null,110,"1.2.2",null,"  z tytułu dotacji oraz środków przeznaczonych na inwestycje",true,8,2024,0,"2016-01-28","2016-01-01"]
[2016,42370,"BRZEZINY",1021011,1,null,110,"1.2.2",null,"  z tytułu dotacji oraz środków przeznaczonych na inwestycje",true,2,2018,0,"2016-01-28","2016-01-01"]
[2016,42370,"BRZEZINY",1021011,1,null,110,"1.2.2",null,"  z tytułu dotacji oraz środków przeznaczonych na inwestycje",true,1,2017,0,"2016-01-28","2016-01-01"]
[2016,42370,"BRZEZINY",1021011,1,null,110,"1.2.2",null,"  z tytułu dotacji oraz środków przeznaczonych na inwestycje",true,0,2016,0,"2016-01-28","2016-01-01"]
[2016,42370,"BRZEZINY",1021011,1,null,900,14.3,null," Wydatki zmniejszające dług, w tym",true,2,2018,0,"2016-01-28","2016-01-01"]
[2016,42370,"BRZEZINY",1021011,1,null,900,14.3,null," Wydatki zmniejszające dług, w tym",true,7,2023,0,"2016-01-28","2016-01-01"]
[2016,42370,"BRZEZINY",1021011,1,null,900,14.3,null," Wydatki zmniejszające dług, w tym",true,1,2017,0,"2016-01-28","2016-01-01"]
[2016,42370,"BRZEZINY",1021011,1,null,900,14.3,null," Wydatki zmniejszające dług, w tym",true,4,2020,0,"2016-01-28","2016-01-01"]
[2016,42370,"BRZEZINY",1021011,1,null,900,14.3,null," Wydatki zmniejszające dług, w tym",true,3,2019,0,"2016-01-28","2016-01-01"]
[2016,42370,"BRZEZINY",1021011,1,null,900,14.3,null," Wydatki zmniejszające dług, w tym",true,5,2021,0,"2016-01-28","2016-01-01"]
[2016,42370,"BRZEZINY",1021011,1,null,900,14.3,null," Wydatki zmniejszające dług, w tym",true,8,2024,0,"2016-01-28","2016-01-01"]
[2016,42370,"BRZEZINY",1021011,1,null,900,14.3,null," Wydatki zmniejszające dług, w tym",true,0,2016,0,"2016-01-28","2016-01-01"]
[2016,42370,"BRZEZINY",1021011,1,null,900,14.3,null," Wydatki zmniejszające dług, w tym",true,6,2022,0,"2016-01-28","2016-01-01"]
[2016,42370,"BRZEZINY",1021011,1,null,850,13.6,null," Wydatki na spłatę zobowiązań samodzielnego publicznego zakładu opieki zdrowotnej przejętych do końca 2011 r. na podstawie przepisów o zakładach opieki zdrowotnej",true,3,2019,0,"2016-01-28","2016-01-01"]
[2016,42370,"BRZEZINY",1021011,1,null,850,13.6,null," Wydatki na spłatę zobowiązań samodzielnego publicznego zakładu opieki zdrowotnej przejętych do końca 2011 r. na podstawie przepisów o zakładach opieki zdrowotnej",true,7,2023,0,"2016-01-28","2016-01-01"]
[2016,42370,"BRZEZINY",1021011,1,null,850,13.6,null," Wydatki na spłatę zobowiązań samodzielnego publicznego zakładu opieki zdrowotnej przejętych do końca 2011 r. na podstawie przepisów o zakładach opieki zdrowotnej",true,5,2021,0,"2016-01-28","2016-01-01"]
[2016,42370,"BRZEZINY",1021011,1,null,850,13.6,null," Wydatki na spłatę zobowiązań samodzielnego publicznego zakładu opieki zdrowotnej przejętych do końca 2011 r. na podstawie przepisów o zakładach opieki zdrowotnej",true,0,2016,0,"2016-01-28","2016-01-01"]
[2016,42370,"BRZEZINY",1021011,1,null,850,13.6,null," Wydatki na spłatę zobowiązań samodzielnego publicznego zakładu opieki zdrowotnej przejętych do końca 2011 r. na podstawie przepisów o zakładach opieki zdrowotnej",true,2,2018,0,"2016-01-28","2016-01-01"]
[2016,42370,"BRZEZINY",1021011,1,null,850,13.6,null," Wydatki na spłatę zobowiązań samodzielnego publicznego zakładu opieki zdrowotnej przejętych do końca 2011 r. na podstawie przepisów o zakładach opieki zdrowotnej",true,6,2022,0,"2016-01-28","2016-01-01"]
[2016,42370,"BRZEZINY",1021011,1,null,850,13.6,null," Wydatki na spłatę zobowiązań samodzielnego publicznego zakładu opieki zdrowotnej przejętych do końca 2011 r. na podstawie przepisów o zakładach opieki zdrowotnej",true,4,2020,0,"2016-01-28","2016-01-01"]
[2016,42370,"BRZEZINY",1021011,1,null,850,13.6,null," Wydatki na spłatę zobowiązań samodzielnego publicznego zakładu opieki zdrowotnej przejętych do końca 2011 r. na podstawie przepisów o zakładach opieki zdrowotnej",true,1,2017,0,"2016-01-28","2016-01-01"]
[2016,42370,"BRZEZINY",1021011,1,null,850,13.6,null," Wydatki na spłatę zobowiązań samodzielnego publicznego zakładu opieki zdrowotnej przejętych do końca 2011 r. na podstawie przepisów o zakładach opieki zdrowotnej",true,8,2024,0,"2016-01-28","2016-01-01"]
[2016,42370,"BRZEZINY",1021011,1,null,610,"11.3.1",null,"   bieżące",true,7,2023,0,"2016-01-28","2016-01-01"]
[2016,42370,"BRZEZINY",1021011,1,null,610,"11.3.1",null,"   bieżące",true,4,2020,0,"2016-01-28","2016-01-01"]
[2016,42370,"BRZEZINY",1021011,1,null,610,"11.3.1",null,"   bieżące",true,5,2021,0,"2016-01-28","2016-01-01"]
[2016,42370,"BRZEZINY",1021011,1,null,610,"11.3.1",null,"   bieżące",true,0,2016,3280,"2016-01-28","2016-01-01"]
[2016,42370,"BRZEZINY",1021011,1,null,610,"11.3.1",null,"   bieżące",true,2,2018,0,"2016-01-28","2016-01-01"]
[2016,42370,"BRZEZINY",1021011,1,null,610,"11.3.1",null,"   bieżące",true,3,2019,0,"2016-01-28","2016-01-01"]
[2016,42370,"BRZEZINY",1021011,1,null,610,"11.3.1",null,"   bieżące",true,1,2017,5520,"2016-01-28","2016-01-01"]
[2016,42370,"BRZEZINY",1021011,1,null,610,"11.3.1",null,"   bieżące",true,8,2024,0,"2016-01-28","2016-01-01"]
[2016,42370,"BRZEZINY",1021011,1,null,610,"11.3.1",null,"   bieżące",true,6,2022,0,"2016-01-28","2016-01-01"]
[2016,42370,"BRZEZINY",1021011,1,null,130,2.1,null," Wydatki bieżące, w tym:",true,8,2024,33700000,"2016-01-28","2016-01-01"]
[2016,42370,"BRZEZINY",1021011,1,null,130,2.1,null," Wydatki bieżące, w tym:",true,3,2019,31200000,"2016-01-28","2016-01-01"]
[2016,42370,"BRZEZINY",1021011,1,null,130,2.1,null," Wydatki bieżące, w tym:",true,0,2016,29810588,"2016-01-28","2016-01-01"]
[2016,42370,"BRZEZINY",1021011,1,null,130,2.1,null," Wydatki bieżące, w tym:",true,5,2021,32200000,"2016-01-28","2016-01-01"]
[2016,42370,"BRZEZINY",1021011,1,null,130,2.1,null," Wydatki bieżące, w tym:",true,1,2017,30200000,"2016-01-28","2016-01-01"]
[2016,42370,"BRZEZINY",1021011,1,null,130,2.1,null," Wydatki bieżące, w tym:",true,4,2020,31700000,"2016-01-28","2016-01-01"]
[2016,42370,"BRZEZINY",1021011,1,null,130,2.1,null," Wydatki bieżące, w tym:",true,2,2018,30700000,"2016-01-28","2016-01-01"]
[2016,42370,"BRZEZINY",1021011,1,null,130,2.1,null," Wydatki bieżące, w tym:",true,7,2023,33200000,"2016-01-28","2016-01-01"]
[2016,42370,"BRZEZINY",1021011,1,null,130,2.1,null," Wydatki bieżące, w tym:",true,6,2022,32700000,"2016-01-28","2016-01-01"]
[2016,42370,"BRZEZINY",1021011,1,null,970,"15.1.1",null,"  środki na zaspokojenie roszczeń obligatariuszy",true,7,2023,0,"2016-01-28","2016-01-01"]
[2016,42370,"BRZEZINY",1021011,1,null,970,"15.1.1",null,"  środki na zaspokojenie roszczeń obligatariuszy",true,1,2017,0,"2016-01-28","2016-01-01"]
[2016,42370,"BRZEZINY",1021011,1,null,970,"15.1.1",null,"  środki na zaspokojenie roszczeń obligatariuszy",true,5,2021,0,"2016-01-28","2016-01-01"]
[2016,42370,"BRZEZINY",1021011,1,null,970,"15.1.1",null,"  środki na zaspokojenie roszczeń obligatariuszy",true,2,2018,0,"2016-01-28","2016-01-01"]
[2016,42370,"BRZEZINY",1021011,1,null,970,"15.1.1",null,"  środki na zaspokojenie roszczeń obligatariuszy",true,3,2019,0,"2016-01-28","2016-01-01"]
[2016,42370,"BRZEZINY",1021011,1,null,970,"15.1.1",null,"  środki na zaspokojenie roszczeń obligatariuszy",true,6,2022,0,"2016-01-28","2016-01-01"]
[2016,42370,"BRZEZINY",1021011,1,null,970,"15.1.1",null,"  środki na zaspokojenie roszczeń obligatariuszy",true,4,2020,0,"2016-01-28","2016-01-01"]
[2016,42370,"BRZEZINY",1021011,1,null,970,"15.1.1",null,"  środki na zaspokojenie roszczeń obligatariuszy",true,0,2016,0,"2016-01-28","2016-01-01"]
[2016,42370,"BRZEZINY",1021011,1,null,970,"15.1.1",null,"  środki na zaspokojenie roszczeń obligatariuszy",true,8,2024,0,"2016-01-28","2016-01-01"]
[2016,42370,"BRZEZINY",1021011,1,null,650,11.6,null," Wydatki majątkowe w formie dotacji ",true,6,2022,0,"2016-01-28","2016-01-01"]
[2016,42370,"BRZEZINY",1021011,1,null,650,11.6,null," Wydatki majątkowe w formie dotacji ",true,4,2020,0,"2016-01-28","2016-01-01"]
[2016,42370,"BRZEZINY",1021011,1,null,650,11.6,null," Wydatki majątkowe w formie dotacji ",true,0,2016,50000,"2016-01-28","2016-01-01"]
[2016,42370,"BRZEZINY",1021011,1,null,650,11.6,null," Wydatki majątkowe w formie dotacji ",true,1,2017,0,"2016-01-28","2016-01-01"]
[2016,42370,"BRZEZINY",1021011,1,null,650,11.6,null," Wydatki majątkowe w formie dotacji ",true,5,2021,0,"2016-01-28","2016-01-01"]
[2016,42370,"BRZEZINY",1021011,1,null,650,11.6,null," Wydatki majątkowe w formie dotacji ",true,2,2018,0,"2016-01-28","2016-01-01"]
[2016,42370,"BRZEZINY",1021011,1,null,650,11.6,null," Wydatki majątkowe w formie dotacji ",true,7,2023,0,"2016-01-28","2016-01-01"]
[2016,42370,"BRZEZINY",1021011,1,null,650,11.6,null," Wydatki majątkowe w formie dotacji ",true,8,2024,0,"2016-01-28","2016-01-01"]
[2016,42370,"BRZEZINY",1021011,1,null,650,11.6,null," Wydatki majątkowe w formie dotacji ",true,3,2019,0,"2016-01-28","2016-01-01"]
[2016,42370,"BRZEZINY",1021011,1,null,570,11,null,"Informacje uzupełniające o wybranych rodzajach wydatków budżetowych",false,6,2022,0,"2016-01-28","2016-01-01"]
[2016,42370,"BRZEZINY",1021011,1,null,570,11,null,"Informacje uzupełniające o wybranych rodzajach wydatków budżetowych",false,5,2021,0,"2016-01-28","2016-01-01"]
[2016,42370,"BRZEZINY",1021011,1,null,570,11,null,"Informacje uzupełniające o wybranych rodzajach wydatków budżetowych",false,8,2024,0,"2016-01-28","2016-01-01"]
[2016,42370,"BRZEZINY",1021011,1,null,570,11,null,"Informacje uzupełniające o wybranych rodzajach wydatków budżetowych",false,0,2016,0,"2016-01-28","2016-01-01"]
[2016,42370,"BRZEZINY",1021011,1,null,570,11,null,"Informacje uzupełniające o wybranych rodzajach wydatków budżetowych",false,7,2023,0,"2016-01-28","2016-01-01"]
[2016,42370,"BRZEZINY",1021011,1,null,570,11,null,"Informacje uzupełniające o wybranych rodzajach wydatków budżetowych",false,3,2019,0,"2016-01-28","2016-01-01"]
[2016,42370,"BRZEZINY",1021011,1,null,570,11,null,"Informacje uzupełniające o wybranych rodzajach wydatków budżetowych",false,4,2020,0,"2016-01-28","2016-01-01"]
[2016,42370,"BRZEZINY",1021011,1,null,570,11,null,"Informacje uzupełniające o wybranych rodzajach wydatków budżetowych",false,2,2018,0,"2016-01-28","2016-01-01"]
[2016,42370,"BRZEZINY",1021011,1,null,570,11,null,"Informacje uzupełniające o wybranych rodzajach wydatków budżetowych",false,1,2017,0,"2016-01-28","2016-01-01"]
[2016,42370,"BRZEZINY",1021011,1,null,960,15.1,null," Środki z przedsięwzięcia gromadzone na rachunku bankowym,  w tym:",true,1,2017,0,"2016-01-28","2016-01-01"]
[2016,42370,"BRZEZINY",1021011,1,null,960,15.1,null," Środki z przedsięwzięcia gromadzone na rachunku bankowym,  w tym:",true,4,2020,0,"2016-01-28","2016-01-01"]
[2016,42370,"BRZEZINY",1021011,1,null,960,15.1,null," Środki z przedsięwzięcia gromadzone na rachunku bankowym,  w tym:",true,3,2019,0,"2016-01-28","2016-01-01"]
[2016,42370,"BRZEZINY",1021011,1,null,960,15.1,null," Środki z przedsięwzięcia gromadzone na rachunku bankowym,  w tym:",true,2,2018,0,"2016-01-28","2016-01-01"]
[2016,42370,"BRZEZINY",1021011,1,null,960,15.1,null," Środki z przedsięwzięcia gromadzone na rachunku bankowym,  w tym:",true,5,2021,0,"2016-01-28","2016-01-01"]
[2016,42370,"BRZEZINY",1021011,1,null,960,15.1,null," Środki z przedsięwzięcia gromadzone na rachunku bankowym,  w tym:",true,8,2024,0,"2016-01-28","2016-01-01"]
[2016,42370,"BRZEZINY",1021011,1,null,960,15.1,null," Środki z przedsięwzięcia gromadzone na rachunku bankowym,  w tym:",true,6,2022,0,"2016-01-28","2016-01-01"]
[2016,42370,"BRZEZINY",1021011,1,null,960,15.1,null," Środki z przedsięwzięcia gromadzone na rachunku bankowym,  w tym:",true,0,2016,0,"2016-01-28","2016-01-01"]
[2016,42370,"BRZEZINY",1021011,1,null,960,15.1,null," Środki z przedsięwzięcia gromadzone na rachunku bankowym,  w tym:",true,7,2023,0,"2016-01-28","2016-01-01"]
[2016,42370,"BRZEZINY",1021011,1,null,230,"4.1.1",null,"  w tym na pokrycie deficytu budżetu",false,0,2016,0,"2016-01-28","2016-01-01"]
[2016,42370,"BRZEZINY",1021011,1,null,230,"4.1.1",null,"  w tym na pokrycie deficytu budżetu",false,5,2021,0,"2016-01-28","2016-01-01"]
[2016,42370,"BRZEZINY",1021011,1,null,230,"4.1.1",null,"  w tym na pokrycie deficytu budżetu",false,8,2024,0,"2016-01-28","2016-01-01"]
[2016,42370,"BRZEZINY",1021011,1,null,230,"4.1.1",null,"  w tym na pokrycie deficytu budżetu",false,7,2023,0,"2016-01-28","2016-01-01"]
[2016,42370,"BRZEZINY",1021011,1,null,230,"4.1.1",null,"  w tym na pokrycie deficytu budżetu",false,1,2017,0,"2016-01-28","2016-01-01"]
[2016,42370,"BRZEZINY",1021011,1,null,230,"4.1.1",null,"  w tym na pokrycie deficytu budżetu",false,2,2018,0,"2016-01-28","2016-01-01"]
[2016,42370,"BRZEZINY",1021011,1,null,230,"4.1.1",null,"  w tym na pokrycie deficytu budżetu",false,6,2022,0,"2016-01-28","2016-01-01"]
[2016,42370,"BRZEZINY",1021011,1,null,230,"4.1.1",null,"  w tym na pokrycie deficytu budżetu",false,3,2019,0,"2016-01-28","2016-01-01"]
[2016,42370,"BRZEZINY",1021011,1,null,230,"4.1.1",null,"  w tym na pokrycie deficytu budżetu",false,4,2020,0,"2016-01-28","2016-01-01"]
[2016,42370,"BRZEZINY",1021011,1,null,940,14.4,null," Wynik operacji niekasowych wpływających na kwotę długu ( m.in. umorzenia, różnice kursowe)",true,1,2017,0,"2016-01-28","2016-01-01"]
[2016,42370,"BRZEZINY",1021011,1,null,940,14.4,null," Wynik operacji niekasowych wpływających na kwotę długu ( m.in. umorzenia, różnice kursowe)",true,2,2018,0,"2016-01-28","2016-01-01"]
[2016,42370,"BRZEZINY",1021011,1,null,940,14.4,null," Wynik operacji niekasowych wpływających na kwotę długu ( m.in. umorzenia, różnice kursowe)",true,0,2016,0,"2016-01-28","2016-01-01"]
[2016,42370,"BRZEZINY",1021011,1,null,940,14.4,null," Wynik operacji niekasowych wpływających na kwotę długu ( m.in. umorzenia, różnice kursowe)",true,5,2021,0,"2016-01-28","2016-01-01"]
[2016,42370,"BRZEZINY",1021011,1,null,940,14.4,null," Wynik operacji niekasowych wpływających na kwotę długu ( m.in. umorzenia, różnice kursowe)",true,8,2024,0,"2016-01-28","2016-01-01"]
[2016,42370,"BRZEZINY",1021011,1,null,940,14.4,null," Wynik operacji niekasowych wpływających na kwotę długu ( m.in. umorzenia, różnice kursowe)",true,6,2022,0,"2016-01-28","2016-01-01"]
[2016,42370,"BRZEZINY",1021011,1,null,940,14.4,null," Wynik operacji niekasowych wpływających na kwotę długu ( m.in. umorzenia, różnice kursowe)",true,3,2019,0,"2016-01-28","2016-01-01"]
[2016,42370,"BRZEZINY",1021011,1,null,940,14.4,null," Wynik operacji niekasowych wpływających na kwotę długu ( m.in. umorzenia, różnice kursowe)",true,7,2023,0,"2016-01-28","2016-01-01"]
[2016,42370,"BRZEZINY",1021011,1,null,940,14.4,null," Wynik operacji niekasowych wpływających na kwotę długu ( m.in. umorzenia, różnice kursowe)",true,4,2020,0,"2016-01-28","2016-01-01"]
[2016,42370,"BRZEZINY",1021011,1,null,550,10,null,"Przeznaczenie prognozowanej nadwyżki budżetowej,  w tym na:",false,0,2016,0,"2016-01-28","2016-01-01"]
[2016,42370,"BRZEZINY",1021011,1,null,550,10,null,"Przeznaczenie prognozowanej nadwyżki budżetowej,  w tym na:",false,1,2017,1478204,"2016-01-28","2016-01-01"]
[2016,42370,"BRZEZINY",1021011,1,null,550,10,null,"Przeznaczenie prognozowanej nadwyżki budżetowej,  w tym na:",false,2,2018,1678204,"2016-01-28","2016-01-01"]
[2016,42370,"BRZEZINY",1021011,1,null,550,10,null,"Przeznaczenie prognozowanej nadwyżki budżetowej,  w tym na:",false,8,2024,3418384,"2016-01-28","2016-01-01"]
[2016,42370,"BRZEZINY",1021011,1,null,550,10,null,"Przeznaczenie prognozowanej nadwyżki budżetowej,  w tym na:",false,5,2021,2210004,"2016-01-28","2016-01-01"]
[2016,42370,"BRZEZINY",1021011,1,null,550,10,null,"Przeznaczenie prognozowanej nadwyżki budżetowej,  w tym na:",false,3,2019,1860004,"2016-01-28","2016-01-01"]
[2016,42370,"BRZEZINY",1021011,1,null,550,10,null,"Przeznaczenie prognozowanej nadwyżki budżetowej,  w tym na:",false,7,2023,2418000,"2016-01-28","2016-01-01"]
[2016,42370,"BRZEZINY",1021011,1,null,550,10,null,"Przeznaczenie prognozowanej nadwyżki budżetowej,  w tym na:",false,4,2020,2210004,"2016-01-28","2016-01-01"]
[2016,42370,"BRZEZINY",1021011,1,null,550,10,null,"Przeznaczenie prognozowanej nadwyżki budżetowej,  w tym na:",false,6,2022,2250004,"2016-01-28","2016-01-01"]
[2016,42370,"BRZEZINY",1021011,1,null,680,"12.1.1",null,"  -  w tym środki określone w art. 5 ust. 1 pkt 2 ustawy",true,8,2024,0,"2016-01-28","2016-01-01"]
[2016,42370,"BRZEZINY",1021011,1,null,680,"12.1.1",null,"  -  w tym środki określone w art. 5 ust. 1 pkt 2 ustawy",true,1,2017,0,"2016-01-28","2016-01-01"]
[2016,42370,"BRZEZINY",1021011,1,null,680,"12.1.1",null,"  -  w tym środki określone w art. 5 ust. 1 pkt 2 ustawy",true,5,2021,0,"2016-01-28","2016-01-01"]
[2016,42370,"BRZEZINY",1021011,1,null,680,"12.1.1",null,"  -  w tym środki określone w art. 5 ust. 1 pkt 2 ustawy",true,7,2023,0,"2016-01-28","2016-01-01"]
[2016,42370,"BRZEZINY",1021011,1,null,680,"12.1.1",null,"  -  w tym środki określone w art. 5 ust. 1 pkt 2 ustawy",true,0,2016,0,"2016-01-28","2016-01-01"]
[2016,42370,"BRZEZINY",1021011,1,null,680,"12.1.1",null,"  -  w tym środki określone w art. 5 ust. 1 pkt 2 ustawy",true,3,2019,0,"2016-01-28","2016-01-01"]
[2016,42370,"BRZEZINY",1021011,1,null,680,"12.1.1",null,"  -  w tym środki określone w art. 5 ust. 1 pkt 2 ustawy",true,2,2018,0,"2016-01-28","2016-01-01"]
[2016,42370,"BRZEZINY",1021011,1,null,680,"12.1.1",null,"  -  w tym środki określone w art. 5 ust. 1 pkt 2 ustawy",true,6,2022,0,"2016-01-28","2016-01-01"]
[2016,42370,"BRZEZINY",1021011,1,null,680,"12.1.1",null,"  -  w tym środki określone w art. 5 ust. 1 pkt 2 ustawy",true,4,2020,0,"2016-01-28","2016-01-01"]
[2016,42370,"BRZEZINY",1021011,1,null,810,13.2,null," Dochody budżetowe z tytułu dotacji celowej z budżetu państwa, o której mowa w art. 196 ustawy z  dnia 15 kwietnia 2011 r.  o działalności leczniczej (Dz.U. Nr 112, poz. 654, z późn. zm.)",true,7,2023,0,"2016-01-28","2016-01-01"]
[2016,42370,"BRZEZINY",1021011,1,null,810,13.2,null," Dochody budżetowe z tytułu dotacji celowej z budżetu państwa, o której mowa w art. 196 ustawy z  dnia 15 kwietnia 2011 r.  o działalności leczniczej (Dz.U. Nr 112, poz. 654, z późn. zm.)",true,6,2022,0,"2016-01-28","2016-01-01"]
[2016,42370,"BRZEZINY",1021011,1,null,810,13.2,null," Dochody budżetowe z tytułu dotacji celowej z budżetu państwa, o której mowa w art. 196 ustawy z  dnia 15 kwietnia 2011 r.  o działalności leczniczej (Dz.U. Nr 112, poz. 654, z późn. zm.)",true,1,2017,0,"2016-01-28","2016-01-01"]
[2016,42370,"BRZEZINY",1021011,1,null,810,13.2,null," Dochody budżetowe z tytułu dotacji celowej z budżetu państwa, o której mowa w art. 196 ustawy z  dnia 15 kwietnia 2011 r.  o działalności leczniczej (Dz.U. Nr 112, poz. 654, z późn. zm.)",true,0,2016,0,"2016-01-28","2016-01-01"]
[2016,42370,"BRZEZINY",1021011,1,null,810,13.2,null," Dochody budżetowe z tytułu dotacji celowej z budżetu państwa, o której mowa w art. 196 ustawy z  dnia 15 kwietnia 2011 r.  o działalności leczniczej (Dz.U. Nr 112, poz. 654, z późn. zm.)",true,3,2019,0,"2016-01-28","2016-01-01"]
[2016,42370,"BRZEZINY",1021011,1,null,810,13.2,null," Dochody budżetowe z tytułu dotacji celowej z budżetu państwa, o której mowa w art. 196 ustawy z  dnia 15 kwietnia 2011 r.  o działalności leczniczej (Dz.U. Nr 112, poz. 654, z późn. zm.)",true,2,2018,0,"2016-01-28","2016-01-01"]
[2016,42370,"BRZEZINY",1021011,1,null,810,13.2,null," Dochody budżetowe z tytułu dotacji celowej z budżetu państwa, o której mowa w art. 196 ustawy z  dnia 15 kwietnia 2011 r.  o działalności leczniczej (Dz.U. Nr 112, poz. 654, z późn. zm.)",true,8,2024,0,"2016-01-28","2016-01-01"]
[2016,42370,"BRZEZINY",1021011,1,null,810,13.2,null," Dochody budżetowe z tytułu dotacji celowej z budżetu państwa, o której mowa w art. 196 ustawy z  dnia 15 kwietnia 2011 r.  o działalności leczniczej (Dz.U. Nr 112, poz. 654, z późn. zm.)",true,4,2020,0,"2016-01-28","2016-01-01"]
[2016,42370,"BRZEZINY",1021011,1,null,810,13.2,null," Dochody budżetowe z tytułu dotacji celowej z budżetu państwa, o której mowa w art. 196 ustawy z  dnia 15 kwietnia 2011 r.  o działalności leczniczej (Dz.U. Nr 112, poz. 654, z późn. zm.)",true,5,2021,0,"2016-01-28","2016-01-01"]
[2016,42370,"BRZEZINY",1021011,1,null,400,7,null,"Kwota zobowiązań wynikających z przejęcia przez jednostkę samorządu terytorialnego zobowiązań po likwidowanych i przekształcanych jednostkach zaliczanych do sektora  finansów publicznych",true,1,2017,0,"2016-01-28","2016-01-01"]
[2016,42370,"BRZEZINY",1021011,1,null,400,7,null,"Kwota zobowiązań wynikających z przejęcia przez jednostkę samorządu terytorialnego zobowiązań po likwidowanych i przekształcanych jednostkach zaliczanych do sektora  finansów publicznych",true,5,2021,0,"2016-01-28","2016-01-01"]
[2016,42370,"BRZEZINY",1021011,1,null,400,7,null,"Kwota zobowiązań wynikających z przejęcia przez jednostkę samorządu terytorialnego zobowiązań po likwidowanych i przekształcanych jednostkach zaliczanych do sektora  finansów publicznych",true,8,2024,0,"2016-01-28","2016-01-01"]
[2016,42370,"BRZEZINY",1021011,1,null,400,7,null,"Kwota zobowiązań wynikających z przejęcia przez jednostkę samorządu terytorialnego zobowiązań po likwidowanych i przekształcanych jednostkach zaliczanych do sektora  finansów publicznych",true,2,2018,0,"2016-01-28","2016-01-01"]
[2016,42370,"BRZEZINY",1021011,1,null,400,7,null,"Kwota zobowiązań wynikających z przejęcia przez jednostkę samorządu terytorialnego zobowiązań po likwidowanych i przekształcanych jednostkach zaliczanych do sektora  finansów publicznych",true,7,2023,0,"2016-01-28","2016-01-01"]
[2016,42370,"BRZEZINY",1021011,1,null,400,7,null,"Kwota zobowiązań wynikających z przejęcia przez jednostkę samorządu terytorialnego zobowiązań po likwidowanych i przekształcanych jednostkach zaliczanych do sektora  finansów publicznych",true,3,2019,0,"2016-01-28","2016-01-01"]
[2016,42370,"BRZEZINY",1021011,1,null,400,7,null,"Kwota zobowiązań wynikających z przejęcia przez jednostkę samorządu terytorialnego zobowiązań po likwidowanych i przekształcanych jednostkach zaliczanych do sektora  finansów publicznych",true,4,2020,0,"2016-01-28","2016-01-01"]
[2016,42370,"BRZEZINY",1021011,1,null,400,7,null,"Kwota zobowiązań wynikających z przejęcia przez jednostkę samorządu terytorialnego zobowiązań po likwidowanych i przekształcanych jednostkach zaliczanych do sektora  finansów publicznych",true,0,2016,0,"2016-01-28","2016-01-01"]
[2016,42370,"BRZEZINY",1021011,1,null,400,7,null,"Kwota zobowiązań wynikających z przejęcia przez jednostkę samorządu terytorialnego zobowiązań po likwidowanych i przekształcanych jednostkach zaliczanych do sektora  finansów publicznych",true,6,2022,0,"2016-01-28","2016-01-01"]
[2016,42370,"BRZEZINY",1021011,1,null,770,"12.8.1",null,"  w tym w związku z już zawartą umową na realizację programu, projektu lub zadania",true,7,2023,0,"2016-01-28","2016-01-01"]
[2016,42370,"BRZEZINY",1021011,1,null,770,"12.8.1",null,"  w tym w związku z już zawartą umową na realizację programu, projektu lub zadania",true,1,2017,0,"2016-01-28","2016-01-01"]
[2016,42370,"BRZEZINY",1021011,1,null,770,"12.8.1",null,"  w tym w związku z już zawartą umową na realizację programu, projektu lub zadania",true,2,2018,0,"2016-01-28","2016-01-01"]
[2016,42370,"BRZEZINY",1021011,1,null,770,"12.8.1",null,"  w tym w związku z już zawartą umową na realizację programu, projektu lub zadania",true,6,2022,0,"2016-01-28","2016-01-01"]
[2016,42370,"BRZEZINY",1021011,1,null,770,"12.8.1",null,"  w tym w związku z już zawartą umową na realizację programu, projektu lub zadania",true,4,2020,0,"2016-01-28","2016-01-01"]
[2016,42370,"BRZEZINY",1021011,1,null,770,"12.8.1",null,"  w tym w związku z już zawartą umową na realizację programu, projektu lub zadania",true,5,2021,0,"2016-01-28","2016-01-01"]
[2016,42370,"BRZEZINY",1021011,1,null,770,"12.8.1",null,"  w tym w związku z już zawartą umową na realizację programu, projektu lub zadania",true,3,2019,0,"2016-01-28","2016-01-01"]
[2016,42370,"BRZEZINY",1021011,1,null,770,"12.8.1",null,"  w tym w związku z już zawartą umową na realizację programu, projektu lub zadania",true,8,2024,0,"2016-01-28","2016-01-01"]
[2016,42370,"BRZEZINY",1021011,1,null,770,"12.8.1",null,"  w tym w związku z już zawartą umową na realizację programu, projektu lub zadania",true,0,2016,0,"2016-01-28","2016-01-01"]
[2016,42370,"BRZEZINY",1021011,1,null,210,4,"[4.1] + [4.2] + [4.3] + [4.4]","Przychody budżetu",false,7,2023,0,"2016-01-28","2016-01-01"]
[2016,42370,"BRZEZINY",1021011,1,null,210,4,"[4.1] + [4.2] + [4.3] + [4.4]","Przychody budżetu",false,2,2018,0,"2016-01-28","2016-01-01"]
[2016,42370,"BRZEZINY",1021011,1,null,210,4,"[4.1] + [4.2] + [4.3] + [4.4]","Przychody budżetu",false,8,2024,0,"2016-01-28","2016-01-01"]
[2016,42370,"BRZEZINY",1021011,1,null,210,4,"[4.1] + [4.2] + [4.3] + [4.4]","Przychody budżetu",false,5,2021,0,"2016-01-28","2016-01-01"]
[2016,42370,"BRZEZINY",1021011,1,null,210,4,"[4.1] + [4.2] + [4.3] + [4.4]","Przychody budżetu",false,1,2017,0,"2016-01-28","2016-01-01"]
[2016,42370,"BRZEZINY",1021011,1,null,210,4,"[4.1] + [4.2] + [4.3] + [4.4]","Przychody budżetu",false,4,2020,0,"2016-01-28","2016-01-01"]
[2016,42370,"BRZEZINY",1021011,1,null,210,4,"[4.1] + [4.2] + [4.3] + [4.4]","Przychody budżetu",false,6,2022,0,"2016-01-28","2016-01-01"]
[2016,42370,"BRZEZINY",1021011,1,null,210,4,"[4.1] + [4.2] + [4.3] + [4.4]","Przychody budżetu",false,3,2019,0,"2016-01-28","2016-01-01"]
[2016,42370,"BRZEZINY",1021011,1,null,210,4,"[4.1] + [4.2] + [4.3] + [4.4]","Przychody budżetu",false,0,2016,1215692,"2016-01-28","2016-01-01"]
[2016,42370,"BRZEZINY",1021011,1,null,160,"2.1.2",null,"   na spłatę przejętych zobowiązań samodzielnego publicznego zakładu opieki zdrowotnej przekształconego na zasadach określonych w przepisach  o działalności leczniczej, w wysokości w jakiej nie podlegają sfinansowaniu dotacją z budżetu państwa",true,6,2022,0,"2016-01-28","2016-01-01"]
[2016,42370,"BRZEZINY",1021011,1,null,160,"2.1.2",null,"   na spłatę przejętych zobowiązań samodzielnego publicznego zakładu opieki zdrowotnej przekształconego na zasadach określonych w przepisach  o działalności leczniczej, w wysokości w jakiej nie podlegają sfinansowaniu dotacją z budżetu państwa",true,7,2023,0,"2016-01-28","2016-01-01"]
[2016,42370,"BRZEZINY",1021011,1,null,160,"2.1.2",null,"   na spłatę przejętych zobowiązań samodzielnego publicznego zakładu opieki zdrowotnej przekształconego na zasadach określonych w przepisach  o działalności leczniczej, w wysokości w jakiej nie podlegają sfinansowaniu dotacją z budżetu państwa",true,8,2024,0,"2016-01-28","2016-01-01"]
[2016,42370,"BRZEZINY",1021011,1,null,950,15,null,"Dane dotyczące emitowanych obligacji przychodowych",true,7,2023,0,"2016-01-28","2016-01-01"]
[2016,42370,"BRZEZINY",1021011,1,null,160,"2.1.2",null,"   na spłatę przejętych zobowiązań samodzielnego publicznego zakładu opieki zdrowotnej przekształconego na zasadach określonych w przepisach  o działalności leczniczej, w wysokości w jakiej nie podlegają sfinansowaniu dotacją z budżetu państwa",true,3,2019,0,"2016-01-28","2016-01-01"]
[2016,42370,"BRZEZINY",1021011,1,null,160,"2.1.2",null,"   na spłatę przejętych zobowiązań samodzielnego publicznego zakładu opieki zdrowotnej przekształconego na zasadach określonych w przepisach  o działalności leczniczej, w wysokości w jakiej nie podlegają sfinansowaniu dotacją z budżetu państwa",true,5,2021,0,"2016-01-28","2016-01-01"]
[2016,42370,"BRZEZINY",1021011,1,null,160,"2.1.2",null,"   na spłatę przejętych zobowiązań samodzielnego publicznego zakładu opieki zdrowotnej przekształconego na zasadach określonych w przepisach  o działalności leczniczej, w wysokości w jakiej nie podlegają sfinansowaniu dotacją z budżetu państwa",true,2,2018,0,"2016-01-28","2016-01-01"]
[2016,42370,"BRZEZINY",1021011,1,null,160,"2.1.2",null,"   na spłatę przejętych zobowiązań samodzielnego publicznego zakładu opieki zdrowotnej przekształconego na zasadach określonych w przepisach  o działalności leczniczej, w wysokości w jakiej nie podlegają sfinansowaniu dotacją z budżetu państwa",true,1,2017,0,"2016-01-28","2016-01-01"]
[2016,42370,"BRZEZINY",1021011,1,null,160,"2.1.2",null,"   na spłatę przejętych zobowiązań samodzielnego publicznego zakładu opieki zdrowotnej przekształconego na zasadach określonych w przepisach  o działalności leczniczej, w wysokości w jakiej nie podlegają sfinansowaniu dotacją z budżetu państwa",true,0,2016,0,"2016-01-28","2016-01-01"]
[2016,42370,"BRZEZINY",1021011,1,null,160,"2.1.2",null,"   na spłatę przejętych zobowiązań samodzielnego publicznego zakładu opieki zdrowotnej przekształconego na zasadach określonych w przepisach  o działalności leczniczej, w wysokości w jakiej nie podlegają sfinansowaniu dotacją z budżetu państwa",true,4,2020,0,"2016-01-28","2016-01-01"]
[2016,42370,"BRZEZINY",1021011,1,null,580,11.1,null," Wydatki bieżące na wynagrodzenia i składki od nich naliczane",false,4,2020,0,"2016-01-28","2016-01-01"]
[2016,42370,"BRZEZINY",1021011,1,null,580,11.1,null," Wydatki bieżące na wynagrodzenia i składki od nich naliczane",false,8,2024,0,"2016-01-28","2016-01-01"]
[2016,42370,"BRZEZINY",1021011,1,null,580,11.1,null," Wydatki bieżące na wynagrodzenia i składki od nich naliczane",false,0,2016,14737410,"2016-01-28","2016-01-01"]
[2016,42370,"BRZEZINY",1021011,1,null,580,11.1,null," Wydatki bieżące na wynagrodzenia i składki od nich naliczane",false,1,2017,15000000,"2016-01-28","2016-01-01"]
[2016,42370,"BRZEZINY",1021011,1,null,580,11.1,null," Wydatki bieżące na wynagrodzenia i składki od nich naliczane",false,3,2019,15600000,"2016-01-28","2016-01-01"]
[2016,42370,"BRZEZINY",1021011,1,null,580,11.1,null," Wydatki bieżące na wynagrodzenia i składki od nich naliczane",false,6,2022,0,"2016-01-28","2016-01-01"]
[2016,42370,"BRZEZINY",1021011,1,null,580,11.1,null," Wydatki bieżące na wynagrodzenia i składki od nich naliczane",false,5,2021,0,"2016-01-28","2016-01-01"]
[2016,42370,"BRZEZINY",1021011,1,null,580,11.1,null," Wydatki bieżące na wynagrodzenia i składki od nich naliczane",false,2,2018,15300000,"2016-01-28","2016-01-01"]
[2016,42370,"BRZEZINY",1021011,1,null,580,11.1,null," Wydatki bieżące na wynagrodzenia i składki od nich naliczane",false,7,2023,0,"2016-01-28","2016-01-01"]
[2016,42370,"BRZEZINY",1021011,1,null,500,9.4,"(([2.1.1]-[2.1.1.1]) + ([2.1.3.1]-[2.1.3.1.1]-[2.1.3.1.2])+([5.1]-[5.1.1])+[9.3]) /([1]-[15.1.1])"," Wskaźnik planowanej łącznej kwoty spłaty zobowiązań, o której mowa w art. 243 ust. 1 ustawy do dochodów, po uwzględnieniu zobowiązań związku współtworzonego przez jednostkę samorządu terytorialnego oraz po uwzględnieniu ustawowych wyłączeń przypadających na dany rok",false,8,2024,8.9399999999999993E-2,"2016-01-28","2016-01-01"]
[2016,42370,"BRZEZINY",1021011,1,null,500,9.4,"(([2.1.1]-[2.1.1.1]) + ([2.1.3.1]-[2.1.3.1.1]-[2.1.3.1.2])+([5.1]-[5.1.1])+[9.3]) /([1]-[15.1.1])"," Wskaźnik planowanej łącznej kwoty spłaty zobowiązań, o której mowa w art. 243 ust. 1 ustawy do dochodów, po uwzględnieniu zobowiązań związku współtworzonego przez jednostkę samorządu terytorialnego oraz po uwzględnieniu ustawowych wyłączeń przypadających na dany rok",false,2,2018,6.6400000000000001E-2,"2016-01-28","2016-01-01"]
[2016,42370,"BRZEZINY",1021011,1,null,500,9.4,"(([2.1.1]-[2.1.1.1]) + ([2.1.3.1]-[2.1.3.1.1]-[2.1.3.1.2])+([5.1]-[5.1.1])+[9.3]) /([1]-[15.1.1])"," Wskaźnik planowanej łącznej kwoty spłaty zobowiązań, o której mowa w art. 243 ust. 1 ustawy do dochodów, po uwzględnieniu zobowiązań związku współtworzonego przez jednostkę samorządu terytorialnego oraz po uwzględnieniu ustawowych wyłączeń przypadających na dany rok",false,7,2023,6.8400000000000002E-2,"2016-01-28","2016-01-01"]
[2016,42370,"BRZEZINY",1021011,1,null,500,9.4,"(([2.1.1]-[2.1.1.1]) + ([2.1.3.1]-[2.1.3.1.1]-[2.1.3.1.2])+([5.1]-[5.1.1])+[9.3]) /([1]-[15.1.1])"," Wskaźnik planowanej łącznej kwoty spłaty zobowiązań, o której mowa w art. 243 ust. 1 ustawy do dochodów, po uwzględnieniu zobowiązań związku współtworzonego przez jednostkę samorządu terytorialnego oraz po uwzględnieniu ustawowych wyłączeń przypadających na dany rok",false,5,2021,7.0900000000000005E-2,"2016-01-28","2016-01-01"]
[2016,42370,"BRZEZINY",1021011,1,null,500,9.4,"(([2.1.1]-[2.1.1.1]) + ([2.1.3.1]-[2.1.3.1.1]-[2.1.3.1.2])+([5.1]-[5.1.1])+[9.3]) /([1]-[15.1.1])"," Wskaźnik planowanej łącznej kwoty spłaty zobowiązań, o której mowa w art. 243 ust. 1 ustawy do dochodów, po uwzględnieniu zobowiązań związku współtworzonego przez jednostkę samorządu terytorialnego oraz po uwzględnieniu ustawowych wyłączeń przypadających na dany rok",false,0,2016,5.6800000000000003E-2,"2016-01-28","2016-01-01"]
[2016,42370,"BRZEZINY",1021011,1,null,500,9.4,"(([2.1.1]-[2.1.1.1]) + ([2.1.3.1]-[2.1.3.1.1]-[2.1.3.1.2])+([5.1]-[5.1.1])+[9.3]) /([1]-[15.1.1])"," Wskaźnik planowanej łącznej kwoty spłaty zobowiązań, o której mowa w art. 243 ust. 1 ustawy do dochodów, po uwzględnieniu zobowiązań związku współtworzonego przez jednostkę samorządu terytorialnego oraz po uwzględnieniu ustawowych wyłączeń przypadających na dany rok",false,6,2022,6.7799999999999999E-2,"2016-01-28","2016-01-01"]
[2016,42370,"BRZEZINY",1021011,1,null,500,9.4,"(([2.1.1]-[2.1.1.1]) + ([2.1.3.1]-[2.1.3.1.1]-[2.1.3.1.2])+([5.1]-[5.1.1])+[9.3]) /([1]-[15.1.1])"," Wskaźnik planowanej łącznej kwoty spłaty zobowiązań, o której mowa w art. 243 ust. 1 ustawy do dochodów, po uwzględnieniu zobowiązań związku współtworzonego przez jednostkę samorządu terytorialnego oraz po uwzględnieniu ustawowych wyłączeń przypadających na dany rok",false,1,2017,6.3200000000000006E-2,"2016-01-28","2016-01-01"]
[2016,42370,"BRZEZINY",1021011,1,null,500,9.4,"(([2.1.1]-[2.1.1.1]) + ([2.1.3.1]-[2.1.3.1.1]-[2.1.3.1.2])+([5.1]-[5.1.1])+[9.3]) /([1]-[15.1.1])"," Wskaźnik planowanej łącznej kwoty spłaty zobowiązań, o której mowa w art. 243 ust. 1 ustawy do dochodów, po uwzględnieniu zobowiązań związku współtworzonego przez jednostkę samorządu terytorialnego oraz po uwzględnieniu ustawowych wyłączeń przypadających na dany rok",false,3,2019,6.8900000000000003E-2,"2016-01-28","2016-01-01"]
[2016,42370,"BRZEZINY",1021011,1,null,500,9.4,"(([2.1.1]-[2.1.1.1]) + ([2.1.3.1]-[2.1.3.1.1]-[2.1.3.1.2])+([5.1]-[5.1.1])+[9.3]) /([1]-[15.1.1])"," Wskaźnik planowanej łącznej kwoty spłaty zobowiązań, o której mowa w art. 243 ust. 1 ustawy do dochodów, po uwzględnieniu zobowiązań związku współtworzonego przez jednostkę samorządu terytorialnego oraz po uwzględnieniu ustawowych wyłączeń przypadających na dany rok",false,4,2020,7.4999999999999997E-2,"2016-01-28","2016-01-01"]
[2016,42370,"BRZEZINY",1021011,1,null,508,9.5,"(([1.1] - [15.1.1])+[1.2.1] - ([2.1]-[2.1.2]-[15.2]))/ ([1]-[15.1.1])"," Wskaźnik dochodów bieżących powiększonych o dochody ze sprzedaży majątku oraz pomniejszonych o wydatki bieżące, do dochodów budżetu, ustalony dla danego roku (wskaźnik jednoroczny)",false,2,2018,9.9699999999999997E-2,"2016-01-28","2016-01-01"]
[2016,42370,"BRZEZINY",1021011,1,null,508,9.5,"(([1.1] - [15.1.1])+[1.2.1] - ([2.1]-[2.1.2]-[15.2]))/ ([1]-[15.1.1])"," Wskaźnik dochodów bieżących powiększonych o dochody ze sprzedaży majątku oraz pomniejszonych o wydatki bieżące, do dochodów budżetu, ustalony dla danego roku (wskaźnik jednoroczny)",false,5,2021,0.1321,"2016-01-28","2016-01-01"]
[2016,42370,"BRZEZINY",1021011,1,null,508,9.5,"(([1.1] - [15.1.1])+[1.2.1] - ([2.1]-[2.1.2]-[15.2]))/ ([1]-[15.1.1])"," Wskaźnik dochodów bieżących powiększonych o dochody ze sprzedaży majątku oraz pomniejszonych o wydatki bieżące, do dochodów budżetu, ustalony dla danego roku (wskaźnik jednoroczny)",false,0,2016,7.3200000000000001E-2,"2016-01-28","2016-01-01"]
[2016,42370,"BRZEZINY",1021011,1,null,508,9.5,"(([1.1] - [15.1.1])+[1.2.1] - ([2.1]-[2.1.2]-[15.2]))/ ([1]-[15.1.1])"," Wskaźnik dochodów bieżących powiększonych o dochody ze sprzedaży majątku oraz pomniejszonych o wydatki bieżące, do dochodów budżetu, ustalony dla danego roku (wskaźnik jednoroczny)",false,6,2022,0.14169999999999999,"2016-01-28","2016-01-01"]
[2016,42370,"BRZEZINY",1021011,1,null,508,9.5,"(([1.1] - [15.1.1])+[1.2.1] - ([2.1]-[2.1.2]-[15.2]))/ ([1]-[15.1.1])"," Wskaźnik dochodów bieżących powiększonych o dochody ze sprzedaży majątku oraz pomniejszonych o wydatki bieżące, do dochodów budżetu, ustalony dla danego roku (wskaźnik jednoroczny)",false,8,2024,0.15959999999999999,"2016-01-28","2016-01-01"]
[2016,42370,"BRZEZINY",1021011,1,null,508,9.5,"(([1.1] - [15.1.1])+[1.2.1] - ([2.1]-[2.1.2]-[15.2]))/ ([1]-[15.1.1])"," Wskaźnik dochodów bieżących powiększonych o dochody ze sprzedaży majątku oraz pomniejszonych o wydatki bieżące, do dochodów budżetu, ustalony dla danego roku (wskaźnik jednoroczny)",false,4,2020,0.12189999999999999,"2016-01-28","2016-01-01"]
[2016,42370,"BRZEZINY",1021011,1,null,508,9.5,"(([1.1] - [15.1.1])+[1.2.1] - ([2.1]-[2.1.2]-[15.2]))/ ([1]-[15.1.1])"," Wskaźnik dochodów bieżących powiększonych o dochody ze sprzedaży majątku oraz pomniejszonych o wydatki bieżące, do dochodów budżetu, ustalony dla danego roku (wskaźnik jednoroczny)",false,7,2023,0.15090000000000001,"2016-01-28","2016-01-01"]
[2016,42370,"BRZEZINY",1021011,1,null,508,9.5,"(([1.1] - [15.1.1])+[1.2.1] - ([2.1]-[2.1.2]-[15.2]))/ ([1]-[15.1.1])"," Wskaźnik dochodów bieżących powiększonych o dochody ze sprzedaży majątku oraz pomniejszonych o wydatki bieżące, do dochodów budżetu, ustalony dla danego roku (wskaźnik jednoroczny)",false,1,2017,8.7599999999999997E-2,"2016-01-28","2016-01-01"]
[2016,42370,"BRZEZINY",1021011,1,null,508,9.5,"(([1.1] - [15.1.1])+[1.2.1] - ([2.1]-[2.1.2]-[15.2]))/ ([1]-[15.1.1])"," Wskaźnik dochodów bieżących powiększonych o dochody ze sprzedaży majątku oraz pomniejszonych o wydatki bieżące, do dochodów budżetu, ustalony dla danego roku (wskaźnik jednoroczny)",false,3,2019,0.1111,"2016-01-28","2016-01-01"]
[2016,42370,"BRZEZINY",1021011,1,null,50,"1.1.3",null,"  podatki i opłaty",true,5,2021,0,"2016-01-28","2016-01-01"]
[2016,42370,"BRZEZINY",1021011,1,null,50,"1.1.3",null,"  podatki i opłaty",true,1,2017,7300000,"2016-01-28","2016-01-01"]
[2016,42370,"BRZEZINY",1021011,1,null,50,"1.1.3",null,"  podatki i opłaty",true,8,2024,0,"2016-01-28","2016-01-01"]
[2016,42370,"BRZEZINY",1021011,1,null,50,"1.1.3",null,"  podatki i opłaty",true,6,2022,0,"2016-01-28","2016-01-01"]
[2016,42370,"BRZEZINY",1021011,1,null,50,"1.1.3",null,"  podatki i opłaty",true,0,2016,7223150,"2016-01-28","2016-01-01"]
[2016,42370,"BRZEZINY",1021011,1,null,50,"1.1.3",null,"  podatki i opłaty",true,4,2020,0,"2016-01-28","2016-01-01"]
[2016,42370,"BRZEZINY",1021011,1,null,50,"1.1.3",null,"  podatki i opłaty",true,2,2018,7400000,"2016-01-28","2016-01-01"]
[2016,42370,"BRZEZINY",1021011,1,null,50,"1.1.3",null,"  podatki i opłaty",true,7,2023,0,"2016-01-28","2016-01-01"]
[2016,42370,"BRZEZINY",1021011,1,null,50,"1.1.3",null,"  podatki i opłaty",true,3,2019,7500000,"2016-01-28","2016-01-01"]
[2016,42370,"BRZEZINY",1021011,1,null,510,9.6,null," Dopuszczalny wskaźnik spłaty zobowiązań określony w art. 243 ustawy, po uwzględnieniu ustawowych wyłączeń , obliczony w oparciu o plan 3 kwartału roku poprzedzającego pierwszy rok prognozy (wskaźnik ustalony w oparciu o średnią arytmetyczną z 3 poprzednich lat) ",true,7,2023,0.13189999999999999,"2016-01-28","2016-01-01"]
[2016,42370,"BRZEZINY",1021011,1,null,510,9.6,null," Dopuszczalny wskaźnik spłaty zobowiązań określony w art. 243 ustawy, po uwzględnieniu ustawowych wyłączeń , obliczony w oparciu o plan 3 kwartału roku poprzedzającego pierwszy rok prognozy (wskaźnik ustalony w oparciu o średnią arytmetyczną z 3 poprzednich lat) ",true,0,2016,6.3799999999999996E-2,"2016-01-28","2016-01-01"]
[2016,42370,"BRZEZINY",1021011,1,null,510,9.6,null," Dopuszczalny wskaźnik spłaty zobowiązań określony w art. 243 ustawy, po uwzględnieniu ustawowych wyłączeń , obliczony w oparciu o plan 3 kwartału roku poprzedzającego pierwszy rok prognozy (wskaźnik ustalony w oparciu o średnią arytmetyczną z 3 poprzednich lat) ",true,8,2024,0.1416,"2016-01-28","2016-01-01"]
[2016,42370,"BRZEZINY",1021011,1,null,510,9.6,null," Dopuszczalny wskaźnik spłaty zobowiązań określony w art. 243 ustawy, po uwzględnieniu ustawowych wyłączeń , obliczony w oparciu o plan 3 kwartału roku poprzedzającego pierwszy rok prognozy (wskaźnik ustalony w oparciu o średnią arytmetyczną z 3 poprzednich lat) ",true,1,2017,6.7199999999999996E-2,"2016-01-28","2016-01-01"]
[2016,42370,"BRZEZINY",1021011,1,null,510,9.6,null," Dopuszczalny wskaźnik spłaty zobowiązań określony w art. 243 ustawy, po uwzględnieniu ustawowych wyłączeń , obliczony w oparciu o plan 3 kwartału roku poprzedzającego pierwszy rok prognozy (wskaźnik ustalony w oparciu o średnią arytmetyczną z 3 poprzednich lat) ",true,2,2018,7.0000000000000007E-2,"2016-01-28","2016-01-01"]
[2016,42370,"BRZEZINY",1021011,1,null,510,9.6,null," Dopuszczalny wskaźnik spłaty zobowiązań określony w art. 243 ustawy, po uwzględnieniu ustawowych wyłączeń , obliczony w oparciu o plan 3 kwartału roku poprzedzającego pierwszy rok prognozy (wskaźnik ustalony w oparciu o średnią arytmetyczną z 3 poprzednich lat) ",true,5,2021,0.1109,"2016-01-28","2016-01-01"]
[2016,42370,"BRZEZINY",1021011,1,null,510,9.6,null," Dopuszczalny wskaźnik spłaty zobowiązań określony w art. 243 ustawy, po uwzględnieniu ustawowych wyłączeń , obliczony w oparciu o plan 3 kwartału roku poprzedzającego pierwszy rok prognozy (wskaźnik ustalony w oparciu o średnią arytmetyczną z 3 poprzednich lat) ",true,6,2022,0.1217,"2016-01-28","2016-01-01"]
[2016,42370,"BRZEZINY",1021011,1,null,510,9.6,null," Dopuszczalny wskaźnik spłaty zobowiązań określony w art. 243 ustawy, po uwzględnieniu ustawowych wyłączeń , obliczony w oparciu o plan 3 kwartału roku poprzedzającego pierwszy rok prognozy (wskaźnik ustalony w oparciu o średnią arytmetyczną z 3 poprzednich lat) ",true,4,2020,9.9500000000000005E-2,"2016-01-28","2016-01-01"]
[2016,42370,"BRZEZINY",1021011,1,null,510,9.6,null," Dopuszczalny wskaźnik spłaty zobowiązań określony w art. 243 ustawy, po uwzględnieniu ustawowych wyłączeń , obliczony w oparciu o plan 3 kwartału roku poprzedzającego pierwszy rok prognozy (wskaźnik ustalony w oparciu o średnią arytmetyczną z 3 poprzednich lat) ",true,3,2019,8.6800000000000002E-2,"2016-01-28","2016-01-01"]
[2016,42370,"BRZEZINY",1021011,1,null,20,1.1000000000000001,null," Dochody bieżące",true,0,2016,32044588,"2016-01-28","2016-01-01"]
[2016,42370,"BRZEZINY",1021011,1,null,20,1.1000000000000001,null," Dochody bieżące",true,7,2023,39100000,"2016-01-28","2016-01-01"]
[2016,42370,"BRZEZINY",1021011,1,null,20,1.1000000000000001,null," Dochody bieżące",true,5,2021,37100000,"2016-01-28","2016-01-01"]
[2016,42370,"BRZEZINY",1021011,1,null,20,1.1000000000000001,null," Dochody bieżące",true,1,2017,33100000,"2016-01-28","2016-01-01"]
[2016,42370,"BRZEZINY",1021011,1,null,20,1.1000000000000001,null," Dochody bieżące",true,3,2019,35100000,"2016-01-28","2016-01-01"]
[2016,42370,"BRZEZINY",1021011,1,null,20,1.1000000000000001,null," Dochody bieżące",true,8,2024,40100000,"2016-01-28","2016-01-01"]
[2016,42370,"BRZEZINY",1021011,1,null,20,1.1000000000000001,null," Dochody bieżące",true,2,2018,34100000,"2016-01-28","2016-01-01"]
[2016,42370,"BRZEZINY",1021011,1,null,20,1.1000000000000001,null," Dochody bieżące",true,6,2022,38100000,"2016-01-28","2016-01-01"]
[2016,42370,"BRZEZINY",1021011,1,null,20,1.1000000000000001,null," Dochody bieżące",true,4,2020,36100000,"2016-01-28","2016-01-01"]
[2016,42370,"BRZEZINY",1021011,1,null,620,"11.3.2",null,"   majątkowe",true,0,2016,844000,"2016-01-28","2016-01-01"]
[2016,42370,"BRZEZINY",1021011,1,null,620,"11.3.2",null,"   majątkowe",true,6,2022,0,"2016-01-28","2016-01-01"]
[2016,42370,"BRZEZINY",1021011,1,null,620,"11.3.2",null,"   majątkowe",true,2,2018,600000,"2016-01-28","2016-01-01"]
[2016,42370,"BRZEZINY",1021011,1,null,620,"11.3.2",null,"   majątkowe",true,7,2023,0,"2016-01-28","2016-01-01"]
[2016,42370,"BRZEZINY",1021011,1,null,620,"11.3.2",null,"   majątkowe",true,1,2017,1309000,"2016-01-28","2016-01-01"]
[2016,42370,"BRZEZINY",1021011,1,null,620,"11.3.2",null,"   majątkowe",true,8,2024,0,"2016-01-28","2016-01-01"]
[2016,42370,"BRZEZINY",1021011,1,null,620,"11.3.2",null,"   majątkowe",true,5,2021,0,"2016-01-28","2016-01-01"]
[2016,42370,"BRZEZINY",1021011,1,null,620,"11.3.2",null,"   majątkowe",true,3,2019,0,"2016-01-28","2016-01-01"]
[2016,42370,"BRZEZINY",1021011,1,null,620,"11.3.2",null,"   majątkowe",true,4,2020,0,"2016-01-28","2016-01-01"]
[2016,42370,"BRZEZINY",1021011,1,null,950,15,null,"Dane dotyczące emitowanych obligacji przychodowych",true,2,2018,0,"2016-01-28","2016-01-01"]
[2016,42370,"BRZEZINY",1021011,1,null,950,15,null,"Dane dotyczące emitowanych obligacji przychodowych",true,0,2016,0,"2016-01-28","2016-01-01"]
[2016,42370,"BRZEZINY",1021011,1,null,950,15,null,"Dane dotyczące emitowanych obligacji przychodowych",true,3,2019,0,"2016-01-28","2016-01-01"]
[2016,42370,"BRZEZINY",1021011,1,null,950,15,null,"Dane dotyczące emitowanych obligacji przychodowych",true,5,2021,0,"2016-01-28","2016-01-01"]
[2016,42370,"BRZEZINY",1021011,1,null,950,15,null,"Dane dotyczące emitowanych obligacji przychodowych",true,8,2024,0,"2016-01-28","2016-01-01"]
[2016,42370,"BRZEZINY",1021011,1,null,950,15,null,"Dane dotyczące emitowanych obligacji przychodowych",true,4,2020,0,"2016-01-28","2016-01-01"]
[2016,42370,"BRZEZINY",1021011,1,null,950,15,null,"Dane dotyczące emitowanych obligacji przychodowych",true,1,2017,0,"2016-01-28","2016-01-01"]
[2016,42370,"BRZEZINY",1021011,1,null,950,15,null,"Dane dotyczące emitowanych obligacji przychodowych",true,6,2022,0,"2016-01-28","2016-01-01"]
[2016,42370,"BRZEZINY",1021011,1,null,470,9.1,"([2.1.1] + [2.1.3.1] + [5.1] ) / [1]"," Wskaźnik planowanej łącznej kwoty spłaty zobowiązań, o której mowa w art. 243 ust. 1 ustawy do dochodów, bez uwzględnienia zobowiązań związku współtworzonego przez jednostkę samorządu terytorialnego  i bez uwzględnienia ustawowych wyłączeń przypadających na dany rok.",true,2,2018,6.6400000000000001E-2,"2016-01-28","2016-01-01"]
[2016,42370,"BRZEZINY",1021011,1,null,470,9.1,"([2.1.1] + [2.1.3.1] + [5.1] ) / [1]"," Wskaźnik planowanej łącznej kwoty spłaty zobowiązań, o której mowa w art. 243 ust. 1 ustawy do dochodów, bez uwzględnienia zobowiązań związku współtworzonego przez jednostkę samorządu terytorialnego  i bez uwzględnienia ustawowych wyłączeń przypadających na dany rok.",true,1,2017,6.3200000000000006E-2,"2016-01-28","2016-01-01"]
[2016,42370,"BRZEZINY",1021011,1,null,470,9.1,"([2.1.1] + [2.1.3.1] + [5.1] ) / [1]"," Wskaźnik planowanej łącznej kwoty spłaty zobowiązań, o której mowa w art. 243 ust. 1 ustawy do dochodów, bez uwzględnienia zobowiązań związku współtworzonego przez jednostkę samorządu terytorialnego  i bez uwzględnienia ustawowych wyłączeń przypadających na dany rok.",true,4,2020,7.4999999999999997E-2,"2016-01-28","2016-01-01"]
[2016,42370,"BRZEZINY",1021011,1,null,470,9.1,"([2.1.1] + [2.1.3.1] + [5.1] ) / [1]"," Wskaźnik planowanej łącznej kwoty spłaty zobowiązań, o której mowa w art. 243 ust. 1 ustawy do dochodów, bez uwzględnienia zobowiązań związku współtworzonego przez jednostkę samorządu terytorialnego  i bez uwzględnienia ustawowych wyłączeń przypadających na dany rok.",true,5,2021,7.0900000000000005E-2,"2016-01-28","2016-01-01"]
[2016,42370,"BRZEZINY",1021011,1,null,470,9.1,"([2.1.1] + [2.1.3.1] + [5.1] ) / [1]"," Wskaźnik planowanej łącznej kwoty spłaty zobowiązań, o której mowa w art. 243 ust. 1 ustawy do dochodów, bez uwzględnienia zobowiązań związku współtworzonego przez jednostkę samorządu terytorialnego  i bez uwzględnienia ustawowych wyłączeń przypadających na dany rok.",true,6,2022,6.7799999999999999E-2,"2016-01-28","2016-01-01"]
[2016,42370,"BRZEZINY",1021011,1,null,470,9.1,"([2.1.1] + [2.1.3.1] + [5.1] ) / [1]"," Wskaźnik planowanej łącznej kwoty spłaty zobowiązań, o której mowa w art. 243 ust. 1 ustawy do dochodów, bez uwzględnienia zobowiązań związku współtworzonego przez jednostkę samorządu terytorialnego  i bez uwzględnienia ustawowych wyłączeń przypadających na dany rok.",true,7,2023,6.8400000000000002E-2,"2016-01-28","2016-01-01"]
[2016,42370,"BRZEZINY",1021011,1,null,470,9.1,"([2.1.1] + [2.1.3.1] + [5.1] ) / [1]"," Wskaźnik planowanej łącznej kwoty spłaty zobowiązań, o której mowa w art. 243 ust. 1 ustawy do dochodów, bez uwzględnienia zobowiązań związku współtworzonego przez jednostkę samorządu terytorialnego  i bez uwzględnienia ustawowych wyłączeń przypadających na dany rok.",true,8,2024,8.9399999999999993E-2,"2016-01-28","2016-01-01"]
[2016,42370,"BRZEZINY",1021011,1,null,470,9.1,"([2.1.1] + [2.1.3.1] + [5.1] ) / [1]"," Wskaźnik planowanej łącznej kwoty spłaty zobowiązań, o której mowa w art. 243 ust. 1 ustawy do dochodów, bez uwzględnienia zobowiązań związku współtworzonego przez jednostkę samorządu terytorialnego  i bez uwzględnienia ustawowych wyłączeń przypadających na dany rok.",true,0,2016,5.6800000000000003E-2,"2016-01-28","2016-01-01"]
[2016,42370,"BRZEZINY",1021011,1,null,470,9.1,"([2.1.1] + [2.1.3.1] + [5.1] ) / [1]"," Wskaźnik planowanej łącznej kwoty spłaty zobowiązań, o której mowa w art. 243 ust. 1 ustawy do dochodów, bez uwzględnienia zobowiązań związku współtworzonego przez jednostkę samorządu terytorialnego  i bez uwzględnienia ustawowych wyłączeń przypadających na dany rok.",true,3,2019,6.8900000000000003E-2,"2016-01-28","2016-01-01"]
[2016,42370,"BRZEZINY",1021011,1,null,890,14.2,null," Kwota długu, którego planowana spłata dokona się z wydatków budżetu",true,6,2022,0,"2016-01-28","2016-01-01"]
[2016,42370,"BRZEZINY",1021011,1,null,890,14.2,null," Kwota długu, którego planowana spłata dokona się z wydatków budżetu",true,7,2023,0,"2016-01-28","2016-01-01"]
[2016,42370,"BRZEZINY",1021011,1,null,890,14.2,null," Kwota długu, którego planowana spłata dokona się z wydatków budżetu",true,2,2018,0,"2016-01-28","2016-01-01"]
[2016,42370,"BRZEZINY",1021011,1,null,890,14.2,null," Kwota długu, którego planowana spłata dokona się z wydatków budżetu",true,8,2024,0,"2016-01-28","2016-01-01"]
[2016,42370,"BRZEZINY",1021011,1,null,890,14.2,null," Kwota długu, którego planowana spłata dokona się z wydatków budżetu",true,0,2016,0,"2016-01-28","2016-01-01"]
[2016,42370,"BRZEZINY",1021011,1,null,890,14.2,null," Kwota długu, którego planowana spłata dokona się z wydatków budżetu",true,1,2017,0,"2016-01-28","2016-01-01"]
[2016,42370,"BRZEZINY",1021011,1,null,890,14.2,null," Kwota długu, którego planowana spłata dokona się z wydatków budżetu",true,4,2020,0,"2016-01-28","2016-01-01"]
[2016,42370,"BRZEZINY",1021011,1,null,890,14.2,null," Kwota długu, którego planowana spłata dokona się z wydatków budżetu",true,5,2021,0,"2016-01-28","2016-01-01"]
[2016,42370,"BRZEZINY",1021011,1,null,890,14.2,null," Kwota długu, którego planowana spłata dokona się z wydatków budżetu",true,3,2019,0,"2016-01-28","2016-01-01"]
[2016,42370,"BRZEZINY",1021011,1,null,300,5,"[5.1] + [5.2]","Rozchody budżetu",false,4,2020,2210004,"2016-01-28","2016-01-01"]
[2016,42370,"BRZEZINY",1021011,1,null,300,5,"[5.1] + [5.2]","Rozchody budżetu",false,6,2022,2250004,"2016-01-28","2016-01-01"]
[2016,42370,"BRZEZINY",1021011,1,null,300,5,"[5.1] + [5.2]","Rozchody budżetu",false,2,2018,1678204,"2016-01-28","2016-01-01"]
[2016,42370,"BRZEZINY",1021011,1,null,300,5,"[5.1] + [5.2]","Rozchody budżetu",false,7,2023,2418000,"2016-01-28","2016-01-01"]
[2016,42370,"BRZEZINY",1021011,1,null,300,5,"[5.1] + [5.2]","Rozchody budżetu",false,3,2019,1860004,"2016-01-28","2016-01-01"]
[2016,42370,"BRZEZINY",1021011,1,null,300,5,"[5.1] + [5.2]","Rozchody budżetu",false,8,2024,3418384,"2016-01-28","2016-01-01"]
[2016,42370,"BRZEZINY",1021011,1,null,300,5,"[5.1] + [5.2]","Rozchody budżetu",false,1,2017,1478204,"2016-01-28","2016-01-01"]
[2016,42370,"BRZEZINY",1021011,1,null,300,5,"[5.1] + [5.2]","Rozchody budżetu",false,0,2016,1215692,"2016-01-28","2016-01-01"]
[2016,42370,"BRZEZINY",1021011,1,null,300,5,"[5.1] + [5.2]","Rozchody budżetu",false,5,2021,2210004,"2016-01-28","2016-01-01"]
[2016,42370,"BRZEZINY",1021011,1,null,840,13.5,null," Wydatki na spłatę przejętych zobowiązań samodzielnego publicznego zakładu opieki zdrowotnej likwidowanego na zasadach określonych w przepisach  o działalności leczniczej",true,0,2016,0,"2016-01-28","2016-01-01"]
[2016,42370,"BRZEZINY",1021011,1,null,840,13.5,null," Wydatki na spłatę przejętych zobowiązań samodzielnego publicznego zakładu opieki zdrowotnej likwidowanego na zasadach określonych w przepisach  o działalności leczniczej",true,8,2024,0,"2016-01-28","2016-01-01"]
[2016,42370,"BRZEZINY",1021011,1,null,840,13.5,null," Wydatki na spłatę przejętych zobowiązań samodzielnego publicznego zakładu opieki zdrowotnej likwidowanego na zasadach określonych w przepisach  o działalności leczniczej",true,5,2021,0,"2016-01-28","2016-01-01"]
[2016,42370,"BRZEZINY",1021011,1,null,840,13.5,null," Wydatki na spłatę przejętych zobowiązań samodzielnego publicznego zakładu opieki zdrowotnej likwidowanego na zasadach określonych w przepisach  o działalności leczniczej",true,6,2022,0,"2016-01-28","2016-01-01"]
[2016,42370,"BRZEZINY",1021011,1,null,840,13.5,null," Wydatki na spłatę przejętych zobowiązań samodzielnego publicznego zakładu opieki zdrowotnej likwidowanego na zasadach określonych w przepisach  o działalności leczniczej",true,1,2017,0,"2016-01-28","2016-01-01"]
[2016,42370,"BRZEZINY",1021011,1,null,840,13.5,null," Wydatki na spłatę przejętych zobowiązań samodzielnego publicznego zakładu opieki zdrowotnej likwidowanego na zasadach określonych w przepisach  o działalności leczniczej",true,4,2020,0,"2016-01-28","2016-01-01"]
[2016,42370,"BRZEZINY",1021011,1,null,840,13.5,null," Wydatki na spłatę przejętych zobowiązań samodzielnego publicznego zakładu opieki zdrowotnej likwidowanego na zasadach określonych w przepisach  o działalności leczniczej",true,7,2023,0,"2016-01-28","2016-01-01"]
[2016,42370,"BRZEZINY",1021011,1,null,840,13.5,null," Wydatki na spłatę przejętych zobowiązań samodzielnego publicznego zakładu opieki zdrowotnej likwidowanego na zasadach określonych w przepisach  o działalności leczniczej",true,3,2019,0,"2016-01-28","2016-01-01"]
[2016,42370,"BRZEZINY",1021011,1,null,840,13.5,null," Wydatki na spłatę przejętych zobowiązań samodzielnego publicznego zakładu opieki zdrowotnej likwidowanego na zasadach określonych w przepisach  o działalności leczniczej",true,2,2018,0,"2016-01-28","2016-01-01"]
[2016,42370,"BRZEZINY",1021011,1,null,870,14,null,"Dane uzupełniające o długu i jego spłacie",true,1,2017,0,"2016-01-28","2016-01-01"]
[2016,42370,"BRZEZINY",1021011,1,null,870,14,null,"Dane uzupełniające o długu i jego spłacie",true,6,2022,0,"2016-01-28","2016-01-01"]
[2016,42370,"BRZEZINY",1021011,1,null,870,14,null,"Dane uzupełniające o długu i jego spłacie",true,7,2023,0,"2016-01-28","2016-01-01"]
[2016,42370,"BRZEZINY",1021011,1,null,870,14,null,"Dane uzupełniające o długu i jego spłacie",true,8,2024,0,"2016-01-28","2016-01-01"]
[2016,42370,"BRZEZINY",1021011,1,null,870,14,null,"Dane uzupełniające o długu i jego spłacie",true,3,2019,0,"2016-01-28","2016-01-01"]
[2016,42370,"BRZEZINY",1021011,1,null,870,14,null,"Dane uzupełniające o długu i jego spłacie",true,4,2020,0,"2016-01-28","2016-01-01"]
[2016,42370,"BRZEZINY",1021011,1,null,870,14,null,"Dane uzupełniające o długu i jego spłacie",true,0,2016,0,"2016-01-28","2016-01-01"]
[2016,42370,"BRZEZINY",1021011,1,null,870,14,null,"Dane uzupełniające o długu i jego spłacie",true,2,2018,0,"2016-01-28","2016-01-01"]
[2016,42370,"BRZEZINY",1021011,1,null,870,14,null,"Dane uzupełniające o długu i jego spłacie",true,5,2021,0,"2016-01-28","2016-01-01"]
[2016,42370,"BRZEZINY",1021011,1,null,430,8.1999999999999993,"[1.1] + [4.1] + [4.2] - (  [2.1] - [2.1.2]  )"," Różnica między dochodami bieżącymi, skorygowanymi o środki a wydatkami bieżącymi, pomniejszonymi  o wydatki",false,7,2023,5900000,"2016-01-28","2016-01-01"]
[2016,42370,"BRZEZINY",1021011,1,null,430,8.1999999999999993,"[1.1] + [4.1] + [4.2] - (  [2.1] - [2.1.2]  )"," Różnica między dochodami bieżącymi, skorygowanymi o środki a wydatkami bieżącymi, pomniejszonymi  o wydatki",false,0,2016,2234000,"2016-01-28","2016-01-01"]
[2016,42370,"BRZEZINY",1021011,1,null,430,8.1999999999999993,"[1.1] + [4.1] + [4.2] - (  [2.1] - [2.1.2]  )"," Różnica między dochodami bieżącymi, skorygowanymi o środki a wydatkami bieżącymi, pomniejszonymi  o wydatki",false,3,2019,3900000,"2016-01-28","2016-01-01"]
[2016,42370,"BRZEZINY",1021011,1,null,430,8.1999999999999993,"[1.1] + [4.1] + [4.2] - (  [2.1] - [2.1.2]  )"," Różnica między dochodami bieżącymi, skorygowanymi o środki a wydatkami bieżącymi, pomniejszonymi  o wydatki",false,5,2021,4900000,"2016-01-28","2016-01-01"]
[2016,42370,"BRZEZINY",1021011,1,null,430,8.1999999999999993,"[1.1] + [4.1] + [4.2] - (  [2.1] - [2.1.2]  )"," Różnica między dochodami bieżącymi, skorygowanymi o środki a wydatkami bieżącymi, pomniejszonymi  o wydatki",false,2,2018,3400000,"2016-01-28","2016-01-01"]
[2016,42370,"BRZEZINY",1021011,1,null,430,8.1999999999999993,"[1.1] + [4.1] + [4.2] - (  [2.1] - [2.1.2]  )"," Różnica między dochodami bieżącymi, skorygowanymi o środki a wydatkami bieżącymi, pomniejszonymi  o wydatki",false,4,2020,4400000,"2016-01-28","2016-01-01"]
[2016,42370,"BRZEZINY",1021011,1,null,430,8.1999999999999993,"[1.1] + [4.1] + [4.2] - (  [2.1] - [2.1.2]  )"," Różnica między dochodami bieżącymi, skorygowanymi o środki a wydatkami bieżącymi, pomniejszonymi  o wydatki",false,1,2017,2900000,"2016-01-28","2016-01-01"]
[2016,42370,"BRZEZINY",1021011,1,null,430,8.1999999999999993,"[1.1] + [4.1] + [4.2] - (  [2.1] - [2.1.2]  )"," Różnica między dochodami bieżącymi, skorygowanymi o środki a wydatkami bieżącymi, pomniejszonymi  o wydatki",false,6,2022,5400000,"2016-01-28","2016-01-01"]
[2016,42370,"BRZEZINY",1021011,1,null,430,8.1999999999999993,"[1.1] + [4.1] + [4.2] - (  [2.1] - [2.1.2]  )"," Różnica między dochodami bieżącymi, skorygowanymi o środki a wydatkami bieżącymi, pomniejszonymi  o wydatki",false,8,2024,6400000,"2016-01-28","2016-01-01"]
[2016,42370,"BRZEZINY",1021011,1,null,270,"4.3.1",null,"   w tym na pokrycie deficytu budżetu",true,5,2021,0,"2016-01-28","2016-01-01"]
[2016,42370,"BRZEZINY",1021011,1,null,270,"4.3.1",null,"   w tym na pokrycie deficytu budżetu",true,8,2024,0,"2016-01-28","2016-01-01"]
[2016,42370,"BRZEZINY",1021011,1,null,270,"4.3.1",null,"   w tym na pokrycie deficytu budżetu",true,6,2022,0,"2016-01-28","2016-01-01"]
[2016,42370,"BRZEZINY",1021011,1,null,270,"4.3.1",null,"   w tym na pokrycie deficytu budżetu",true,1,2017,0,"2016-01-28","2016-01-01"]
[2016,42370,"BRZEZINY",1021011,1,null,270,"4.3.1",null,"   w tym na pokrycie deficytu budżetu",true,7,2023,0,"2016-01-28","2016-01-01"]
[2016,42370,"BRZEZINY",1021011,1,null,270,"4.3.1",null,"   w tym na pokrycie deficytu budżetu",true,4,2020,0,"2016-01-28","2016-01-01"]
[2016,42370,"BRZEZINY",1021011,1,null,270,"4.3.1",null,"   w tym na pokrycie deficytu budżetu",true,0,2016,0,"2016-01-28","2016-01-01"]
[2016,42370,"BRZEZINY",1021011,1,null,270,"4.3.1",null,"   w tym na pokrycie deficytu budżetu",true,2,2018,0,"2016-01-28","2016-01-01"]
[2016,42370,"BRZEZINY",1021011,1,null,270,"4.3.1",null,"   w tym na pokrycie deficytu budżetu",true,3,2019,0,"2016-01-28","2016-01-01"]
[2016,42370,"BRZEZINY",1021011,1,null,70,"1.1.4",null,"  z subwencji ogólnej",true,5,2021,0,"2016-01-28","2016-01-01"]
[2016,42370,"BRZEZINY",1021011,1,null,70,"1.1.4",null,"  z subwencji ogólnej",true,6,2022,0,"2016-01-28","2016-01-01"]
[2016,42370,"BRZEZINY",1021011,1,null,70,"1.1.4",null,"  z subwencji ogólnej",true,2,2018,9400000,"2016-01-28","2016-01-01"]
[2016,42370,"BRZEZINY",1021011,1,null,70,"1.1.4",null,"  z subwencji ogólnej",true,0,2016,9238483,"2016-01-28","2016-01-01"]
[2016,42370,"BRZEZINY",1021011,1,null,70,"1.1.4",null,"  z subwencji ogólnej",true,4,2020,0,"2016-01-28","2016-01-01"]
[2016,42370,"BRZEZINY",1021011,1,null,70,"1.1.4",null,"  z subwencji ogólnej",true,7,2023,0,"2016-01-28","2016-01-01"]
[2016,42370,"BRZEZINY",1021011,1,null,70,"1.1.4",null,"  z subwencji ogólnej",true,1,2017,9300000,"2016-01-28","2016-01-01"]
[2016,42370,"BRZEZINY",1021011,1,null,70,"1.1.4",null,"  z subwencji ogólnej",true,8,2024,0,"2016-01-28","2016-01-01"]
[2016,42370,"BRZEZINY",1021011,1,null,70,"1.1.4",null,"  z subwencji ogólnej",true,3,2019,9500000,"2016-01-28","2016-01-01"]
[2016,42370,"BRZEZINY",1021011,1,null,260,4.3,null,"  Kredyty, pożyczki, emisja papierów wartościowych",true,5,2021,0,"2016-01-28","2016-01-01"]
[2016,42370,"BRZEZINY",1021011,1,null,260,4.3,null,"  Kredyty, pożyczki, emisja papierów wartościowych",true,4,2020,0,"2016-01-28","2016-01-01"]
[2016,42370,"BRZEZINY",1021011,1,null,260,4.3,null,"  Kredyty, pożyczki, emisja papierów wartościowych",true,3,2019,0,"2016-01-28","2016-01-01"]
[2016,42370,"BRZEZINY",1021011,1,null,260,4.3,null,"  Kredyty, pożyczki, emisja papierów wartościowych",true,8,2024,0,"2016-01-28","2016-01-01"]
[2016,42370,"BRZEZINY",1021011,1,null,260,4.3,null,"  Kredyty, pożyczki, emisja papierów wartościowych",true,0,2016,1215692,"2016-01-28","2016-01-01"]
[2016,42370,"BRZEZINY",1021011,1,null,260,4.3,null,"  Kredyty, pożyczki, emisja papierów wartościowych",true,2,2018,0,"2016-01-28","2016-01-01"]
[2016,42370,"BRZEZINY",1021011,1,null,260,4.3,null,"  Kredyty, pożyczki, emisja papierów wartościowych",true,7,2023,0,"2016-01-28","2016-01-01"]
[2016,42370,"BRZEZINY",1021011,1,null,260,4.3,null,"  Kredyty, pożyczki, emisja papierów wartościowych",true,1,2017,0,"2016-01-28","2016-01-01"]
[2016,42370,"BRZEZINY",1021011,1,null,260,4.3,null,"  Kredyty, pożyczki, emisja papierów wartościowych",true,6,2022,0,"2016-01-28","2016-01-01"]
[2016,42370,"BRZEZINY",1021011,1,null,10,1,"[1.1] + [1.2]","Dochody ogółem",true,2,2018,34100000,"2016-01-28","2016-01-01"]
[2016,42370,"BRZEZINY",1021011,1,null,10,1,"[1.1] + [1.2]","Dochody ogółem",true,1,2017,33100000,"2016-01-28","2016-01-01"]
[2016,42370,"BRZEZINY",1021011,1,null,10,1,"[1.1] + [1.2]","Dochody ogółem",true,5,2021,37100000,"2016-01-28","2016-01-01"]
[2016,42370,"BRZEZINY",1021011,1,null,10,1,"[1.1] + [1.2]","Dochody ogółem",true,4,2020,36100000,"2016-01-28","2016-01-01"]
[2016,42370,"BRZEZINY",1021011,1,null,10,1,"[1.1] + [1.2]","Dochody ogółem",true,7,2023,39100000,"2016-01-28","2016-01-01"]
[2016,42370,"BRZEZINY",1021011,1,null,10,1,"[1.1] + [1.2]","Dochody ogółem",true,3,2019,35100000,"2016-01-28","2016-01-01"]
[2016,42370,"BRZEZINY",1021011,1,null,10,1,"[1.1] + [1.2]","Dochody ogółem",true,8,2024,40100000,"2016-01-28","2016-01-01"]
[2016,42370,"BRZEZINY",1021011,1,null,10,1,"[1.1] + [1.2]","Dochody ogółem",true,0,2016,32174588,"2016-01-28","2016-01-01"]
[2016,42370,"BRZEZINY",1021011,1,null,10,1,"[1.1] + [1.2]","Dochody ogółem",true,6,2022,38100000,"2016-01-28","2016-01-01"]
[2016,42370,"BRZEZINY",1021011,1,null,350,6,null,"Kwota długu",true,7,2023,3418384,"2016-01-28","2016-01-01"]
[2016,42370,"BRZEZINY",1021011,1,null,350,6,null,"Kwota długu",true,1,2017,16044604,"2016-01-28","2016-01-01"]
[2016,42370,"BRZEZINY",1021011,1,null,350,6,null,"Kwota długu",true,8,2024,0,"2016-01-28","2016-01-01"]
[2016,42370,"BRZEZINY",1021011,1,null,350,6,null,"Kwota długu",true,0,2016,17522808,"2016-01-28","2016-01-01"]
[2016,42370,"BRZEZINY",1021011,1,null,350,6,null,"Kwota długu",true,2,2018,14366400,"2016-01-28","2016-01-01"]
[2016,42370,"BRZEZINY",1021011,1,null,350,6,null,"Kwota długu",true,4,2020,10296392,"2016-01-28","2016-01-01"]
[2016,42370,"BRZEZINY",1021011,1,null,350,6,null,"Kwota długu",true,3,2019,12506396,"2016-01-28","2016-01-01"]
[2016,42370,"BRZEZINY",1021011,1,null,350,6,null,"Kwota długu",true,5,2021,8086388,"2016-01-28","2016-01-01"]
[2016,42370,"BRZEZINY",1021011,1,null,350,6,null,"Kwota długu",true,6,2022,5836384,"2016-01-28","2016-01-01"]
[2016,42370,"BRZEZINY",1021011,1,null,630,11.4,null," Wydatki inwestycyjne kontynuowane ",true,2,2018,0,"2016-01-28","2016-01-01"]
[2016,42370,"BRZEZINY",1021011,1,null,630,11.4,null," Wydatki inwestycyjne kontynuowane ",true,7,2023,0,"2016-01-28","2016-01-01"]
[2016,42370,"BRZEZINY",1021011,1,null,630,11.4,null," Wydatki inwestycyjne kontynuowane ",true,1,2017,0,"2016-01-28","2016-01-01"]
[2016,42370,"BRZEZINY",1021011,1,null,630,11.4,null," Wydatki inwestycyjne kontynuowane ",true,8,2024,0,"2016-01-28","2016-01-01"]
[2016,42370,"BRZEZINY",1021011,1,null,630,11.4,null," Wydatki inwestycyjne kontynuowane ",true,0,2016,1564000,"2016-01-28","2016-01-01"]
[2016,42370,"BRZEZINY",1021011,1,null,630,11.4,null," Wydatki inwestycyjne kontynuowane ",true,6,2022,0,"2016-01-28","2016-01-01"]
[2016,42370,"BRZEZINY",1021011,1,null,630,11.4,null," Wydatki inwestycyjne kontynuowane ",true,5,2021,0,"2016-01-28","2016-01-01"]
[2016,42370,"BRZEZINY",1021011,1,null,630,11.4,null," Wydatki inwestycyjne kontynuowane ",true,3,2019,0,"2016-01-28","2016-01-01"]
[2016,42370,"BRZEZINY",1021011,1,null,630,11.4,null," Wydatki inwestycyjne kontynuowane ",true,4,2020,0,"2016-01-28","2016-01-01"]
[2016,42370,"BRZEZINY",1021011,1,null,660,12,null,"Finansowanie programów, projektów lub zadań realizowanych z udziałem środków, o których mowa w art. 5 ust. 1 pkt 2 i 3 ustawy",true,1,2017,0,"2016-01-28","2016-01-01"]
[2016,42370,"BRZEZINY",1021011,1,null,660,12,null,"Finansowanie programów, projektów lub zadań realizowanych z udziałem środków, o których mowa w art. 5 ust. 1 pkt 2 i 3 ustawy",true,8,2024,0,"2016-01-28","2016-01-01"]
[2016,42370,"BRZEZINY",1021011,1,null,660,12,null,"Finansowanie programów, projektów lub zadań realizowanych z udziałem środków, o których mowa w art. 5 ust. 1 pkt 2 i 3 ustawy",true,0,2016,0,"2016-01-28","2016-01-01"]
[2016,42370,"BRZEZINY",1021011,1,null,660,12,null,"Finansowanie programów, projektów lub zadań realizowanych z udziałem środków, o których mowa w art. 5 ust. 1 pkt 2 i 3 ustawy",true,4,2020,0,"2016-01-28","2016-01-01"]
[2016,42370,"BRZEZINY",1021011,1,null,660,12,null,"Finansowanie programów, projektów lub zadań realizowanych z udziałem środków, o których mowa w art. 5 ust. 1 pkt 2 i 3 ustawy",true,5,2021,0,"2016-01-28","2016-01-01"]
[2016,42370,"BRZEZINY",1021011,1,null,660,12,null,"Finansowanie programów, projektów lub zadań realizowanych z udziałem środków, o których mowa w art. 5 ust. 1 pkt 2 i 3 ustawy",true,3,2019,0,"2016-01-28","2016-01-01"]
[2016,42370,"BRZEZINY",1021011,1,null,660,12,null,"Finansowanie programów, projektów lub zadań realizowanych z udziałem środków, o których mowa w art. 5 ust. 1 pkt 2 i 3 ustawy",true,7,2023,0,"2016-01-28","2016-01-01"]
[2016,42370,"BRZEZINY",1021011,1,null,660,12,null,"Finansowanie programów, projektów lub zadań realizowanych z udziałem środków, o których mowa w art. 5 ust. 1 pkt 2 i 3 ustawy",true,6,2022,0,"2016-01-28","2016-01-01"]
[2016,42370,"BRZEZINY",1021011,1,null,660,12,null,"Finansowanie programów, projektów lub zadań realizowanych z udziałem środków, o których mowa w art. 5 ust. 1 pkt 2 i 3 ustawy",true,2,2018,0,"2016-01-28","2016-01-01"]
[2016,42370,"BRZEZINY",1021011,1,null,764,"12.5.1",null,"  w tym w związku z już zawartą umową na realizację programu, projektu lub zadania",true,2,2018,0,"2016-01-28","2016-01-01"]
[2016,42370,"BRZEZINY",1021011,1,null,764,"12.5.1",null,"  w tym w związku z już zawartą umową na realizację programu, projektu lub zadania",true,3,2019,0,"2016-01-28","2016-01-01"]
[2016,42370,"BRZEZINY",1021011,1,null,764,"12.5.1",null,"  w tym w związku z już zawartą umową na realizację programu, projektu lub zadania",true,1,2017,0,"2016-01-28","2016-01-01"]
[2016,42370,"BRZEZINY",1021011,1,null,764,"12.5.1",null,"  w tym w związku z już zawartą umową na realizację programu, projektu lub zadania",true,7,2023,0,"2016-01-28","2016-01-01"]
[2016,42370,"BRZEZINY",1021011,1,null,764,"12.5.1",null,"  w tym w związku z już zawartą umową na realizację programu, projektu lub zadania",true,8,2024,0,"2016-01-28","2016-01-01"]
[2016,42370,"BRZEZINY",1021011,1,null,764,"12.5.1",null,"  w tym w związku z już zawartą umową na realizację programu, projektu lub zadania",true,5,2021,0,"2016-01-28","2016-01-01"]
[2016,42370,"BRZEZINY",1021011,1,null,764,"12.5.1",null,"  w tym w związku z już zawartą umową na realizację programu, projektu lub zadania",true,4,2020,0,"2016-01-28","2016-01-01"]
[2016,42370,"BRZEZINY",1021011,1,null,764,"12.5.1",null,"  w tym w związku z już zawartą umową na realizację programu, projektu lub zadania",true,6,2022,0,"2016-01-28","2016-01-01"]
[2016,42370,"BRZEZINY",1021011,1,null,764,"12.5.1",null,"  w tym w związku z już zawartą umową na realizację programu, projektu lub zadania",true,0,2016,0,"2016-01-28","2016-01-01"]
[2016,42370,"BRZEZINY",1021011,1,null,768,"12.7.1",null,"  w tym w związku z już zawartą umową na realizację programu, projektu lub zadania",true,0,2016,0,"2016-01-28","2016-01-01"]
[2016,42370,"BRZEZINY",1021011,1,null,768,"12.7.1",null,"  w tym w związku z już zawartą umową na realizację programu, projektu lub zadania",true,8,2024,0,"2016-01-28","2016-01-01"]
[2016,42370,"BRZEZINY",1021011,1,null,768,"12.7.1",null,"  w tym w związku z już zawartą umową na realizację programu, projektu lub zadania",true,4,2020,0,"2016-01-28","2016-01-01"]
[2016,42370,"BRZEZINY",1021011,1,null,768,"12.7.1",null,"  w tym w związku z już zawartą umową na realizację programu, projektu lub zadania",true,7,2023,0,"2016-01-28","2016-01-01"]
[2016,42370,"BRZEZINY",1021011,1,null,768,"12.7.1",null,"  w tym w związku z już zawartą umową na realizację programu, projektu lub zadania",true,6,2022,0,"2016-01-28","2016-01-01"]
[2016,42370,"BRZEZINY",1021011,1,null,768,"12.7.1",null,"  w tym w związku z już zawartą umową na realizację programu, projektu lub zadania",true,3,2019,0,"2016-01-28","2016-01-01"]
[2016,42370,"BRZEZINY",1021011,1,null,768,"12.7.1",null,"  w tym w związku z już zawartą umową na realizację programu, projektu lub zadania",true,5,2021,0,"2016-01-28","2016-01-01"]
[2016,42370,"BRZEZINY",1021011,1,null,768,"12.7.1",null,"  w tym w związku z już zawartą umową na realizację programu, projektu lub zadania",true,1,2017,0,"2016-01-28","2016-01-01"]
[2016,42370,"BRZEZINY",1021011,1,null,768,"12.7.1",null,"  w tym w związku z już zawartą umową na realizację programu, projektu lub zadania",true,2,2018,0,"2016-01-28","2016-01-01"]
[2016,42370,"BRZEZINY",1021011,1,null,740,"12.3.1",null,"  -  w tym finansowane środkami określonymi w art. 5 ust. 1 pkt 2 ustawy ",false,8,2024,0,"2016-01-28","2016-01-01"]
[2016,42370,"BRZEZINY",1021011,1,null,740,"12.3.1",null,"  -  w tym finansowane środkami określonymi w art. 5 ust. 1 pkt 2 ustawy ",false,5,2021,0,"2016-01-28","2016-01-01"]
[2016,42370,"BRZEZINY",1021011,1,null,740,"12.3.1",null,"  -  w tym finansowane środkami określonymi w art. 5 ust. 1 pkt 2 ustawy ",false,7,2023,0,"2016-01-28","2016-01-01"]
[2016,42370,"BRZEZINY",1021011,1,null,740,"12.3.1",null,"  -  w tym finansowane środkami określonymi w art. 5 ust. 1 pkt 2 ustawy ",false,3,2019,0,"2016-01-28","2016-01-01"]
[2016,42370,"BRZEZINY",1021011,1,null,740,"12.3.1",null,"  -  w tym finansowane środkami określonymi w art. 5 ust. 1 pkt 2 ustawy ",false,6,2022,0,"2016-01-28","2016-01-01"]
[2016,42370,"BRZEZINY",1021011,1,null,740,"12.3.1",null,"  -  w tym finansowane środkami określonymi w art. 5 ust. 1 pkt 2 ustawy ",false,2,2018,0,"2016-01-28","2016-01-01"]
[2016,42370,"BRZEZINY",1021011,1,null,740,"12.3.1",null,"  -  w tym finansowane środkami określonymi w art. 5 ust. 1 pkt 2 ustawy ",false,4,2020,0,"2016-01-28","2016-01-01"]
[2016,42370,"BRZEZINY",1021011,1,null,740,"12.3.1",null,"  -  w tym finansowane środkami określonymi w art. 5 ust. 1 pkt 2 ustawy ",false,1,2017,0,"2016-01-28","2016-01-01"]
[2016,42370,"BRZEZINY",1021011,1,null,740,"12.3.1",null,"  -  w tym finansowane środkami określonymi w art. 5 ust. 1 pkt 2 ustawy ",false,0,2016,0,"2016-01-28","2016-01-01"]
[2016,42370,"BRZEZINY",1021011,1,null,710,"12.2.1",null,"   -  w tym środki określone w art. 5 ust. 1 pkt 2 ustawy",false,3,2019,0,"2016-01-28","2016-01-01"]
[2016,42370,"BRZEZINY",1021011,1,null,710,"12.2.1",null,"   -  w tym środki określone w art. 5 ust. 1 pkt 2 ustawy",false,4,2020,0,"2016-01-28","2016-01-01"]
[2016,42370,"BRZEZINY",1021011,1,null,710,"12.2.1",null,"   -  w tym środki określone w art. 5 ust. 1 pkt 2 ustawy",false,5,2021,0,"2016-01-28","2016-01-01"]
[2016,42370,"BRZEZINY",1021011,1,null,710,"12.2.1",null,"   -  w tym środki określone w art. 5 ust. 1 pkt 2 ustawy",false,7,2023,0,"2016-01-28","2016-01-01"]
[2016,42370,"BRZEZINY",1021011,1,null,710,"12.2.1",null,"   -  w tym środki określone w art. 5 ust. 1 pkt 2 ustawy",false,1,2017,0,"2016-01-28","2016-01-01"]
[2016,42370,"BRZEZINY",1021011,1,null,710,"12.2.1",null,"   -  w tym środki określone w art. 5 ust. 1 pkt 2 ustawy",false,6,2022,0,"2016-01-28","2016-01-01"]
[2016,42370,"BRZEZINY",1021011,1,null,710,"12.2.1",null,"   -  w tym środki określone w art. 5 ust. 1 pkt 2 ustawy",false,8,2024,0,"2016-01-28","2016-01-01"]
[2016,42370,"BRZEZINY",1021011,1,null,710,"12.2.1",null,"   -  w tym środki określone w art. 5 ust. 1 pkt 2 ustawy",false,2,2018,0,"2016-01-28","2016-01-01"]
[2016,42370,"BRZEZINY",1021011,1,null,710,"12.2.1",null,"   -  w tym środki określone w art. 5 ust. 1 pkt 2 ustawy",false,0,2016,0,"2016-01-28","2016-01-01"]
[2016,42370,"BRZEZINY",1021011,1,null,180,"2.1.3.1",null,"   odsetki i dyskonto określone w art. 243 ust. 1 ustawy, w tym:",false,3,2019,440000,"2016-01-28","2016-01-01"]
[2016,42370,"BRZEZINY",1021011,1,null,180,"2.1.3.1",null,"   odsetki i dyskonto określone w art. 243 ust. 1 ustawy, w tym:",false,5,2021,300000,"2016-01-28","2016-01-01"]
[2016,42370,"BRZEZINY",1021011,1,null,180,"2.1.3.1",null,"   odsetki i dyskonto określone w art. 243 ust. 1 ustawy, w tym:",false,8,2024,40000,"2016-01-28","2016-01-01"]
[2016,42370,"BRZEZINY",1021011,1,null,180,"2.1.3.1",null,"   odsetki i dyskonto określone w art. 243 ust. 1 ustawy, w tym:",false,1,2017,500000,"2016-01-28","2016-01-01"]
[2016,42370,"BRZEZINY",1021011,1,null,180,"2.1.3.1",null,"   odsetki i dyskonto określone w art. 243 ust. 1 ustawy, w tym:",false,2,2018,470000,"2016-01-28","2016-01-01"]
[2016,42370,"BRZEZINY",1021011,1,null,180,"2.1.3.1",null,"   odsetki i dyskonto określone w art. 243 ust. 1 ustawy, w tym:",false,6,2022,210000,"2016-01-28","2016-01-01"]
[2016,42370,"BRZEZINY",1021011,1,null,180,"2.1.3.1",null,"   odsetki i dyskonto określone w art. 243 ust. 1 ustawy, w tym:",false,7,2023,130000,"2016-01-28","2016-01-01"]
[2016,42370,"BRZEZINY",1021011,1,null,180,"2.1.3.1",null,"   odsetki i dyskonto określone w art. 243 ust. 1 ustawy, w tym:",false,0,2016,500000,"2016-01-28","2016-01-01"]
[2016,42370,"BRZEZINY",1021011,1,null,180,"2.1.3.1",null,"   odsetki i dyskonto określone w art. 243 ust. 1 ustawy, w tym:",false,4,2020,380000,"2016-01-28","2016-01-01"]
[2016,42370,"BRZEZINY",1021011,1,null,730,12.3,null," Wydatki bieżące na programy, projekty lub zadania finansowane z udziałem środków, o których mowa w art. 5 ust. 1 pkt 2 i 3 ustawy",false,8,2024,0,"2016-01-28","2016-01-01"]
[2016,42370,"BRZEZINY",1021011,1,null,730,12.3,null," Wydatki bieżące na programy, projekty lub zadania finansowane z udziałem środków, o których mowa w art. 5 ust. 1 pkt 2 i 3 ustawy",false,0,2016,0,"2016-01-28","2016-01-01"]
[2016,42370,"BRZEZINY",1021011,1,null,730,12.3,null," Wydatki bieżące na programy, projekty lub zadania finansowane z udziałem środków, o których mowa w art. 5 ust. 1 pkt 2 i 3 ustawy",false,5,2021,0,"2016-01-28","2016-01-01"]
[2016,42370,"BRZEZINY",1021011,1,null,730,12.3,null," Wydatki bieżące na programy, projekty lub zadania finansowane z udziałem środków, o których mowa w art. 5 ust. 1 pkt 2 i 3 ustawy",false,2,2018,0,"2016-01-28","2016-01-01"]
[2016,42370,"BRZEZINY",1021011,1,null,730,12.3,null," Wydatki bieżące na programy, projekty lub zadania finansowane z udziałem środków, o których mowa w art. 5 ust. 1 pkt 2 i 3 ustawy",false,1,2017,0,"2016-01-28","2016-01-01"]
[2016,42370,"BRZEZINY",1021011,1,null,730,12.3,null," Wydatki bieżące na programy, projekty lub zadania finansowane z udziałem środków, o których mowa w art. 5 ust. 1 pkt 2 i 3 ustawy",false,6,2022,0,"2016-01-28","2016-01-01"]
[2016,42370,"BRZEZINY",1021011,1,null,730,12.3,null," Wydatki bieżące na programy, projekty lub zadania finansowane z udziałem środków, o których mowa w art. 5 ust. 1 pkt 2 i 3 ustawy",false,3,2019,0,"2016-01-28","2016-01-01"]
[2016,42370,"BRZEZINY",1021011,1,null,730,12.3,null," Wydatki bieżące na programy, projekty lub zadania finansowane z udziałem środków, o których mowa w art. 5 ust. 1 pkt 2 i 3 ustawy",false,7,2023,0,"2016-01-28","2016-01-01"]
[2016,42370,"BRZEZINY",1021011,1,null,730,12.3,null," Wydatki bieżące na programy, projekty lub zadania finansowane z udziałem środków, o których mowa w art. 5 ust. 1 pkt 2 i 3 ustawy",false,4,2020,0,"2016-01-28","2016-01-01"]
[2016,42370,"BRZEZINY",1021011,1,null,190,2.2000000000000002,null," Wydatki majątkowe",false,0,2016,2364000,"2016-01-28","2016-01-01"]
[2016,42370,"BRZEZINY",1021011,1,null,190,2.2000000000000002,null," Wydatki majątkowe",false,2,2018,1721796,"2016-01-28","2016-01-01"]
[2016,42370,"BRZEZINY",1021011,1,null,190,2.2000000000000002,null," Wydatki majątkowe",false,8,2024,2981616,"2016-01-28","2016-01-01"]
[2016,42370,"BRZEZINY",1021011,1,null,190,2.2000000000000002,null," Wydatki majątkowe",false,3,2019,2039996,"2016-01-28","2016-01-01"]
[2016,42370,"BRZEZINY",1021011,1,null,190,2.2000000000000002,null," Wydatki majątkowe",false,1,2017,1421796,"2016-01-28","2016-01-01"]
[2016,42370,"BRZEZINY",1021011,1,null,190,2.2000000000000002,null," Wydatki majątkowe",false,7,2023,3482000,"2016-01-28","2016-01-01"]
[2016,42370,"BRZEZINY",1021011,1,null,190,2.2000000000000002,null," Wydatki majątkowe",false,5,2021,2689996,"2016-01-28","2016-01-01"]
[2016,42370,"BRZEZINY",1021011,1,null,190,2.2000000000000002,null," Wydatki majątkowe",false,4,2020,2189996,"2016-01-28","2016-01-01"]
[2016,42370,"BRZEZINY",1021011,1,null,190,2.2000000000000002,null," Wydatki majątkowe",false,6,2022,3149996,"2016-01-28","2016-01-01"]
[2016,42370,"BRZEZINY",1021011,1,null,1000,16.100000000000001,null," Stopień niezachowania relacji zrównoważenia wydatków bieżących, o której mowa w poz. 8.2.",true,5,2021,0,"2016-01-28","2016-01-01"]
[2016,42370,"BRZEZINY",1021011,1,null,1000,16.100000000000001,null," Stopień niezachowania relacji zrównoważenia wydatków bieżących, o której mowa w poz. 8.2.",true,3,2019,0,"2016-01-28","2016-01-01"]
[2016,42370,"BRZEZINY",1021011,1,null,1000,16.100000000000001,null," Stopień niezachowania relacji zrównoważenia wydatków bieżących, o której mowa w poz. 8.2.",true,0,2016,0,"2016-01-28","2016-01-01"]
[2016,42370,"BRZEZINY",1021011,1,null,1000,16.100000000000001,null," Stopień niezachowania relacji zrównoważenia wydatków bieżących, o której mowa w poz. 8.2.",true,8,2024,0,"2016-01-28","2016-01-01"]
[2016,42370,"BRZEZINY",1021011,1,null,1000,16.100000000000001,null," Stopień niezachowania relacji zrównoważenia wydatków bieżących, o której mowa w poz. 8.2.",true,4,2020,0,"2016-01-28","2016-01-01"]
[2016,42370,"BRZEZINY",1021011,1,null,1000,16.100000000000001,null," Stopień niezachowania relacji zrównoważenia wydatków bieżących, o której mowa w poz. 8.2.",true,6,2022,0,"2016-01-28","2016-01-01"]
[2016,42370,"BRZEZINY",1021011,1,null,1000,16.100000000000001,null," Stopień niezachowania relacji zrównoważenia wydatków bieżących, o której mowa w poz. 8.2.",true,7,2023,0,"2016-01-28","2016-01-01"]
[2016,42370,"BRZEZINY",1021011,1,null,1000,16.100000000000001,null," Stopień niezachowania relacji zrównoważenia wydatków bieżących, o której mowa w poz. 8.2.",true,1,2017,0,"2016-01-28","2016-01-01"]
[2016,42370,"BRZEZINY",1021011,1,null,1000,16.100000000000001,null," Stopień niezachowania relacji zrównoważenia wydatków bieżących, o której mowa w poz. 8.2.",true,2,2018,0,"2016-01-28","2016-01-01"]
[2016,42370,"BRZEZINY",1021011,1,null,910,"14.3.1",null,"  spłata zobowiązań wymagalnych z lat poprzednich, innych niż w pkt 14.3.3",true,8,2024,0,"2016-01-28","2016-01-01"]
[2016,42370,"BRZEZINY",1021011,1,null,910,"14.3.1",null,"  spłata zobowiązań wymagalnych z lat poprzednich, innych niż w pkt 14.3.3",true,6,2022,0,"2016-01-28","2016-01-01"]
[2016,42370,"BRZEZINY",1021011,1,null,910,"14.3.1",null,"  spłata zobowiązań wymagalnych z lat poprzednich, innych niż w pkt 14.3.3",true,3,2019,0,"2016-01-28","2016-01-01"]
[2016,42370,"BRZEZINY",1021011,1,null,910,"14.3.1",null,"  spłata zobowiązań wymagalnych z lat poprzednich, innych niż w pkt 14.3.3",true,5,2021,0,"2016-01-28","2016-01-01"]
[2016,42370,"BRZEZINY",1021011,1,null,910,"14.3.1",null,"  spłata zobowiązań wymagalnych z lat poprzednich, innych niż w pkt 14.3.3",true,4,2020,0,"2016-01-28","2016-01-01"]
[2016,42370,"BRZEZINY",1021011,1,null,910,"14.3.1",null,"  spłata zobowiązań wymagalnych z lat poprzednich, innych niż w pkt 14.3.3",true,0,2016,0,"2016-01-28","2016-01-01"]
[2016,42370,"BRZEZINY",1021011,1,null,910,"14.3.1",null,"  spłata zobowiązań wymagalnych z lat poprzednich, innych niż w pkt 14.3.3",true,2,2018,0,"2016-01-28","2016-01-01"]
[2016,42370,"BRZEZINY",1021011,1,null,910,"14.3.1",null,"  spłata zobowiązań wymagalnych z lat poprzednich, innych niż w pkt 14.3.3",true,7,2023,0,"2016-01-28","2016-01-01"]
[2016,42370,"BRZEZINY",1021011,1,null,910,"14.3.1",null,"  spłata zobowiązań wymagalnych z lat poprzednich, innych niż w pkt 14.3.3",true,1,2017,0,"2016-01-28","2016-01-01"]
[2016,42370,"BRZEZINY",1021011,1,null,140,"2.1.1",null,"  z tytułu poręczeń i gwarancji",true,8,2024,128000,"2016-01-28","2016-01-01"]
[2016,42370,"BRZEZINY",1021011,1,null,140,"2.1.1",null,"  z tytułu poręczeń i gwarancji",true,6,2022,123000,"2016-01-28","2016-01-01"]
[2016,42370,"BRZEZINY",1021011,1,null,140,"2.1.1",null,"  z tytułu poręczeń i gwarancji",true,2,2018,116000,"2016-01-28","2016-01-01"]
[2016,42370,"BRZEZINY",1021011,1,null,140,"2.1.1",null,"  z tytułu poręczeń i gwarancji",true,3,2019,117000,"2016-01-28","2016-01-01"]
[2016,42370,"BRZEZINY",1021011,1,null,140,"2.1.1",null,"  z tytułu poręczeń i gwarancji",true,1,2017,114000,"2016-01-28","2016-01-01"]
[2016,42370,"BRZEZINY",1021011,1,null,140,"2.1.1",null,"  z tytułu poręczeń i gwarancji",true,5,2021,121000,"2016-01-28","2016-01-01"]
[2016,42370,"BRZEZINY",1021011,1,null,140,"2.1.1",null,"  z tytułu poręczeń i gwarancji",true,7,2023,126000,"2016-01-28","2016-01-01"]
[2016,42370,"BRZEZINY",1021011,1,null,140,"2.1.1",null,"  z tytułu poręczeń i gwarancji",true,4,2020,119000,"2016-01-28","2016-01-01"]
[2016,42370,"BRZEZINY",1021011,1,null,140,"2.1.1",null,"  z tytułu poręczeń i gwarancji",true,0,2016,113000,"2016-01-28","2016-01-01"]
[2016,42370,"BRZEZINY",1021011,1,null,990,16,null,"Stopnie niezachowania relacji określonych w art. 242-244 ustawy w przypadku określonym w @par16_1 ustawy",true,2,2018,0,"2016-01-28","2016-01-01"]
[2016,42370,"BRZEZINY",1021011,1,null,990,16,null,"Stopnie niezachowania relacji określonych w art. 242-244 ustawy w przypadku określonym w @par16_1 ustawy",true,5,2021,0,"2016-01-28","2016-01-01"]
[2016,42370,"BRZEZINY",1021011,1,null,990,16,null,"Stopnie niezachowania relacji określonych w art. 242-244 ustawy w przypadku określonym w @par16_1 ustawy",true,0,2016,0,"2016-01-28","2016-01-01"]
[2016,42370,"BRZEZINY",1021011,1,null,990,16,null,"Stopnie niezachowania relacji określonych w art. 242-244 ustawy w przypadku określonym w @par16_1 ustawy",true,8,2024,0,"2016-01-28","2016-01-01"]
[2016,42370,"BRZEZINY",1021011,1,null,990,16,null,"Stopnie niezachowania relacji określonych w art. 242-244 ustawy w przypadku określonym w @par16_1 ustawy",true,1,2017,0,"2016-01-28","2016-01-01"]
[2016,42370,"BRZEZINY",1021011,1,null,990,16,null,"Stopnie niezachowania relacji określonych w art. 242-244 ustawy w przypadku określonym w @par16_1 ustawy",true,4,2020,0,"2016-01-28","2016-01-01"]
[2016,42370,"BRZEZINY",1021011,1,null,990,16,null,"Stopnie niezachowania relacji określonych w art. 242-244 ustawy w przypadku określonym w @par16_1 ustawy",true,6,2022,0,"2016-01-28","2016-01-01"]
[2016,42370,"BRZEZINY",1021011,1,null,990,16,null,"Stopnie niezachowania relacji określonych w art. 242-244 ustawy w przypadku określonym w @par16_1 ustawy",true,3,2019,0,"2016-01-28","2016-01-01"]
[2016,42370,"BRZEZINY",1021011,1,null,990,16,null,"Stopnie niezachowania relacji określonych w art. 242-244 ustawy w przypadku określonym w @par16_1 ustawy",true,7,2023,0,"2016-01-28","2016-01-01"]
[2016,42370,"BRZEZINY",1021011,1,null,334,"5.1.1.2",null,"   kwota przypadających na dany rok kwot ustawowych wyłączeń określonych w art. 243 ust. 3a ustawy",true,3,2019,0,"2016-01-28","2016-01-01"]
[2016,42370,"BRZEZINY",1021011,1,null,334,"5.1.1.2",null,"   kwota przypadających na dany rok kwot ustawowych wyłączeń określonych w art. 243 ust. 3a ustawy",true,8,2024,0,"2016-01-28","2016-01-01"]
[2016,42370,"BRZEZINY",1021011,1,null,334,"5.1.1.2",null,"   kwota przypadających na dany rok kwot ustawowych wyłączeń określonych w art. 243 ust. 3a ustawy",true,6,2022,0,"2016-01-28","2016-01-01"]
[2016,42370,"BRZEZINY",1021011,1,null,334,"5.1.1.2",null,"   kwota przypadających na dany rok kwot ustawowych wyłączeń określonych w art. 243 ust. 3a ustawy",true,2,2018,0,"2016-01-28","2016-01-01"]
[2016,42370,"BRZEZINY",1021011,1,null,334,"5.1.1.2",null,"   kwota przypadających na dany rok kwot ustawowych wyłączeń określonych w art. 243 ust. 3a ustawy",true,0,2016,0,"2016-01-28","2016-01-01"]
[2016,42370,"BRZEZINY",1021011,1,null,334,"5.1.1.2",null,"   kwota przypadających na dany rok kwot ustawowych wyłączeń określonych w art. 243 ust. 3a ustawy",true,1,2017,0,"2016-01-28","2016-01-01"]
[2016,42370,"BRZEZINY",1021011,1,null,334,"5.1.1.2",null,"   kwota przypadających na dany rok kwot ustawowych wyłączeń określonych w art. 243 ust. 3a ustawy",true,5,2021,0,"2016-01-28","2016-01-01"]
[2016,42370,"BRZEZINY",1021011,1,null,334,"5.1.1.2",null,"   kwota przypadających na dany rok kwot ustawowych wyłączeń określonych w art. 243 ust. 3a ustawy",true,4,2020,0,"2016-01-28","2016-01-01"]
[2016,42370,"BRZEZINY",1021011,1,null,334,"5.1.1.2",null,"   kwota przypadających na dany rok kwot ustawowych wyłączeń określonych w art. 243 ust. 3a ustawy",true,7,2023,0,"2016-01-28","2016-01-01"]
[2016,42370,"BRZEZINY",1021011,1,null,762,"12.4.2",null,"  Wydatki majątkowe na realizację programu, projektu lub zadania wynikające wyłącznie z zawartych umów z podmiotem dysponującym środkami, o których mowa w art. 5 ust. 1 pkt 2 ustawy ",true,8,2024,0,"2016-01-28","2016-01-01"]
[2016,42370,"BRZEZINY",1021011,1,null,762,"12.4.2",null,"  Wydatki majątkowe na realizację programu, projektu lub zadania wynikające wyłącznie z zawartych umów z podmiotem dysponującym środkami, o których mowa w art. 5 ust. 1 pkt 2 ustawy ",true,0,2016,0,"2016-01-28","2016-01-01"]
[2016,42370,"BRZEZINY",1021011,1,null,762,"12.4.2",null,"  Wydatki majątkowe na realizację programu, projektu lub zadania wynikające wyłącznie z zawartych umów z podmiotem dysponującym środkami, o których mowa w art. 5 ust. 1 pkt 2 ustawy ",true,3,2019,0,"2016-01-28","2016-01-01"]
[2016,42370,"BRZEZINY",1021011,1,null,762,"12.4.2",null,"  Wydatki majątkowe na realizację programu, projektu lub zadania wynikające wyłącznie z zawartych umów z podmiotem dysponującym środkami, o których mowa w art. 5 ust. 1 pkt 2 ustawy ",true,7,2023,0,"2016-01-28","2016-01-01"]
[2016,42370,"BRZEZINY",1021011,1,null,762,"12.4.2",null,"  Wydatki majątkowe na realizację programu, projektu lub zadania wynikające wyłącznie z zawartych umów z podmiotem dysponującym środkami, o których mowa w art. 5 ust. 1 pkt 2 ustawy ",true,1,2017,0,"2016-01-28","2016-01-01"]
[2016,42370,"BRZEZINY",1021011,1,null,762,"12.4.2",null,"  Wydatki majątkowe na realizację programu, projektu lub zadania wynikające wyłącznie z zawartych umów z podmiotem dysponującym środkami, o których mowa w art. 5 ust. 1 pkt 2 ustawy ",true,5,2021,0,"2016-01-28","2016-01-01"]
[2016,42370,"BRZEZINY",1021011,1,null,762,"12.4.2",null,"  Wydatki majątkowe na realizację programu, projektu lub zadania wynikające wyłącznie z zawartych umów z podmiotem dysponującym środkami, o których mowa w art. 5 ust. 1 pkt 2 ustawy ",true,4,2020,0,"2016-01-28","2016-01-01"]
[2016,42370,"BRZEZINY",1021011,1,null,762,"12.4.2",null,"  Wydatki majątkowe na realizację programu, projektu lub zadania wynikające wyłącznie z zawartych umów z podmiotem dysponującym środkami, o których mowa w art. 5 ust. 1 pkt 2 ustawy ",true,2,2018,0,"2016-01-28","2016-01-01"]
[2016,42370,"BRZEZINY",1021011,1,null,762,"12.4.2",null,"  Wydatki majątkowe na realizację programu, projektu lub zadania wynikające wyłącznie z zawartych umów z podmiotem dysponującym środkami, o których mowa w art. 5 ust. 1 pkt 2 ustawy ",true,6,2022,0,"2016-01-28","2016-01-01"]
[2016,42370,"BRZEZINY",1021011,1,null,690,"12.1.1.1",null,"   - w tym środki określone w art. 5 ust. 1 pkt 2 ustawy wynikające wyłącznie z  zawartych umów na realizację programu, projektu lub zadania",true,5,2021,0,"2016-01-28","2016-01-01"]
[2016,42370,"BRZEZINY",1021011,1,null,690,"12.1.1.1",null,"   - w tym środki określone w art. 5 ust. 1 pkt 2 ustawy wynikające wyłącznie z  zawartych umów na realizację programu, projektu lub zadania",true,3,2019,0,"2016-01-28","2016-01-01"]
[2016,42370,"BRZEZINY",1021011,1,null,690,"12.1.1.1",null,"   - w tym środki określone w art. 5 ust. 1 pkt 2 ustawy wynikające wyłącznie z  zawartych umów na realizację programu, projektu lub zadania",true,8,2024,0,"2016-01-28","2016-01-01"]
[2016,42370,"BRZEZINY",1021011,1,null,690,"12.1.1.1",null,"   - w tym środki określone w art. 5 ust. 1 pkt 2 ustawy wynikające wyłącznie z  zawartych umów na realizację programu, projektu lub zadania",true,6,2022,0,"2016-01-28","2016-01-01"]
[2016,42370,"BRZEZINY",1021011,1,null,690,"12.1.1.1",null,"   - w tym środki określone w art. 5 ust. 1 pkt 2 ustawy wynikające wyłącznie z  zawartych umów na realizację programu, projektu lub zadania",true,4,2020,0,"2016-01-28","2016-01-01"]
[2016,42370,"BRZEZINY",1021011,1,null,690,"12.1.1.1",null,"   - w tym środki określone w art. 5 ust. 1 pkt 2 ustawy wynikające wyłącznie z  zawartych umów na realizację programu, projektu lub zadania",true,1,2017,0,"2016-01-28","2016-01-01"]
[2016,42370,"BRZEZINY",1021011,1,null,690,"12.1.1.1",null,"   - w tym środki określone w art. 5 ust. 1 pkt 2 ustawy wynikające wyłącznie z  zawartych umów na realizację programu, projektu lub zadania",true,7,2023,0,"2016-01-28","2016-01-01"]
[2016,42370,"BRZEZINY",1021011,1,null,690,"12.1.1.1",null,"   - w tym środki określone w art. 5 ust. 1 pkt 2 ustawy wynikające wyłącznie z  zawartych umów na realizację programu, projektu lub zadania",true,0,2016,0,"2016-01-28","2016-01-01"]
[2016,42370,"BRZEZINY",1021011,1,null,690,"12.1.1.1",null,"   - w tym środki określone w art. 5 ust. 1 pkt 2 ustawy wynikające wyłącznie z  zawartych umów na realizację programu, projektu lub zadania",true,2,2018,0,"2016-01-28","2016-01-01"]
[2016,42370,"BRZEZINY",1021011,1,null,930,"14.3.3",null,"  wypłaty z tytułu wymagalnych poręczeń i gwarancji",true,1,2017,0,"2016-01-28","2016-01-01"]
[2016,42370,"BRZEZINY",1021011,1,null,930,"14.3.3",null,"  wypłaty z tytułu wymagalnych poręczeń i gwarancji",true,3,2019,0,"2016-01-28","2016-01-01"]
[2016,42370,"BRZEZINY",1021011,1,null,930,"14.3.3",null,"  wypłaty z tytułu wymagalnych poręczeń i gwarancji",true,6,2022,0,"2016-01-28","2016-01-01"]
[2016,42370,"BRZEZINY",1021011,1,null,930,"14.3.3",null,"  wypłaty z tytułu wymagalnych poręczeń i gwarancji",true,2,2018,0,"2016-01-28","2016-01-01"]
[2016,42370,"BRZEZINY",1021011,1,null,930,"14.3.3",null,"  wypłaty z tytułu wymagalnych poręczeń i gwarancji",true,5,2021,0,"2016-01-28","2016-01-01"]
[2016,42370,"BRZEZINY",1021011,1,null,930,"14.3.3",null,"  wypłaty z tytułu wymagalnych poręczeń i gwarancji",true,0,2016,0,"2016-01-28","2016-01-01"]
[2016,42370,"BRZEZINY",1021011,1,null,930,"14.3.3",null,"  wypłaty z tytułu wymagalnych poręczeń i gwarancji",true,8,2024,0,"2016-01-28","2016-01-01"]
[2016,42370,"BRZEZINY",1021011,1,null,930,"14.3.3",null,"  wypłaty z tytułu wymagalnych poręczeń i gwarancji",true,7,2023,0,"2016-01-28","2016-01-01"]
[2016,42370,"BRZEZINY",1021011,1,null,930,"14.3.3",null,"  wypłaty z tytułu wymagalnych poręczeń i gwarancji",true,4,2020,0,"2016-01-28","2016-01-01"]
[2016,42370,"BRZEZINY",1021011,1,null,420,8.1,"[1.1] - [2.1]"," Różnica między dochodami bieżącymi a  wydatkami bieżącymi",false,5,2021,4900000,"2016-01-28","2016-01-01"]
[2016,42370,"BRZEZINY",1021011,1,null,420,8.1,"[1.1] - [2.1]"," Różnica między dochodami bieżącymi a  wydatkami bieżącymi",false,3,2019,3900000,"2016-01-28","2016-01-01"]
[2016,42370,"BRZEZINY",1021011,1,null,420,8.1,"[1.1] - [2.1]"," Różnica między dochodami bieżącymi a  wydatkami bieżącymi",false,0,2016,2234000,"2016-01-28","2016-01-01"]
[2016,42370,"BRZEZINY",1021011,1,null,420,8.1,"[1.1] - [2.1]"," Różnica między dochodami bieżącymi a  wydatkami bieżącymi",false,4,2020,4400000,"2016-01-28","2016-01-01"]
[2016,42370,"BRZEZINY",1021011,1,null,420,8.1,"[1.1] - [2.1]"," Różnica między dochodami bieżącymi a  wydatkami bieżącymi",false,2,2018,3400000,"2016-01-28","2016-01-01"]
[2016,42370,"BRZEZINY",1021011,1,null,420,8.1,"[1.1] - [2.1]"," Różnica między dochodami bieżącymi a  wydatkami bieżącymi",false,8,2024,6400000,"2016-01-28","2016-01-01"]
[2016,42370,"BRZEZINY",1021011,1,null,420,8.1,"[1.1] - [2.1]"," Różnica między dochodami bieżącymi a  wydatkami bieżącymi",false,7,2023,5900000,"2016-01-28","2016-01-01"]
[2016,42370,"BRZEZINY",1021011,1,null,420,8.1,"[1.1] - [2.1]"," Różnica między dochodami bieżącymi a  wydatkami bieżącymi",false,1,2017,2900000,"2016-01-28","2016-01-01"]
[2016,42370,"BRZEZINY",1021011,1,null,420,8.1,"[1.1] - [2.1]"," Różnica między dochodami bieżącymi a  wydatkami bieżącymi",false,6,2022,5400000,"2016-01-28","2016-01-01"]
[2016,42370,"BRZEZINY",1021011,1,null,750,"12.3.2",null,"  Wydatki bieżące na realizację programu, projektu lub zadania wynikające wyłącznie z zawartych umów z podmiotem dysponującym środkami, o których mowa w art. 5 ust. 1 pkt 2 ustawy ",false,3,2019,0,"2016-01-28","2016-01-01"]
[2016,42370,"BRZEZINY",1021011,1,null,750,"12.3.2",null,"  Wydatki bieżące na realizację programu, projektu lub zadania wynikające wyłącznie z zawartych umów z podmiotem dysponującym środkami, o których mowa w art. 5 ust. 1 pkt 2 ustawy ",false,2,2018,0,"2016-01-28","2016-01-01"]
[2016,42370,"BRZEZINY",1021011,1,null,750,"12.3.2",null,"  Wydatki bieżące na realizację programu, projektu lub zadania wynikające wyłącznie z zawartych umów z podmiotem dysponującym środkami, o których mowa w art. 5 ust. 1 pkt 2 ustawy ",false,1,2017,0,"2016-01-28","2016-01-01"]
[2016,42370,"BRZEZINY",1021011,1,null,750,"12.3.2",null,"  Wydatki bieżące na realizację programu, projektu lub zadania wynikające wyłącznie z zawartych umów z podmiotem dysponującym środkami, o których mowa w art. 5 ust. 1 pkt 2 ustawy ",false,7,2023,0,"2016-01-28","2016-01-01"]
[2016,42370,"BRZEZINY",1021011,1,null,750,"12.3.2",null,"  Wydatki bieżące na realizację programu, projektu lub zadania wynikające wyłącznie z zawartych umów z podmiotem dysponującym środkami, o których mowa w art. 5 ust. 1 pkt 2 ustawy ",false,5,2021,0,"2016-01-28","2016-01-01"]
[2016,42370,"BRZEZINY",1021011,1,null,750,"12.3.2",null,"  Wydatki bieżące na realizację programu, projektu lub zadania wynikające wyłącznie z zawartych umów z podmiotem dysponującym środkami, o których mowa w art. 5 ust. 1 pkt 2 ustawy ",false,6,2022,0,"2016-01-28","2016-01-01"]
[2016,42370,"BRZEZINY",1021011,1,null,750,"12.3.2",null,"  Wydatki bieżące na realizację programu, projektu lub zadania wynikające wyłącznie z zawartych umów z podmiotem dysponującym środkami, o których mowa w art. 5 ust. 1 pkt 2 ustawy ",false,8,2024,0,"2016-01-28","2016-01-01"]
[2016,42370,"BRZEZINY",1021011,1,null,750,"12.3.2",null,"  Wydatki bieżące na realizację programu, projektu lub zadania wynikające wyłącznie z zawartych umów z podmiotem dysponującym środkami, o których mowa w art. 5 ust. 1 pkt 2 ustawy ",false,4,2020,0,"2016-01-28","2016-01-01"]
[2016,42370,"BRZEZINY",1021011,1,null,750,"12.3.2",null,"  Wydatki bieżące na realizację programu, projektu lub zadania wynikające wyłącznie z zawartych umów z podmiotem dysponującym środkami, o których mowa w art. 5 ust. 1 pkt 2 ustawy ",false,0,2016,0,"2016-01-28","2016-01-01"]
[2016,42370,"BRZEZINY",1021011,1,null,120,2,"[2.1] + [2.2]","Wydatki ogółem",false,6,2022,35849996,"2016-01-28","2016-01-01"]
[2016,42370,"BRZEZINY",1021011,1,null,120,2,"[2.1] + [2.2]","Wydatki ogółem",false,5,2021,34889996,"2016-01-28","2016-01-01"]
[2016,42370,"BRZEZINY",1021011,1,null,120,2,"[2.1] + [2.2]","Wydatki ogółem",false,2,2018,32421796,"2016-01-28","2016-01-01"]
[2016,42370,"BRZEZINY",1021011,1,null,120,2,"[2.1] + [2.2]","Wydatki ogółem",false,0,2016,32174588,"2016-01-28","2016-01-01"]
[2016,42370,"BRZEZINY",1021011,1,null,120,2,"[2.1] + [2.2]","Wydatki ogółem",false,7,2023,36682000,"2016-01-28","2016-01-01"]
[2016,42370,"BRZEZINY",1021011,1,null,120,2,"[2.1] + [2.2]","Wydatki ogółem",false,8,2024,36681616,"2016-01-28","2016-01-01"]
[2016,42370,"BRZEZINY",1021011,1,null,120,2,"[2.1] + [2.2]","Wydatki ogółem",false,3,2019,33239996,"2016-01-28","2016-01-01"]
[2016,42370,"BRZEZINY",1021011,1,null,120,2,"[2.1] + [2.2]","Wydatki ogółem",false,4,2020,33889996,"2016-01-28","2016-01-01"]
[2016,42370,"BRZEZINY",1021011,1,null,120,2,"[2.1] + [2.2]","Wydatki ogółem",false,1,2017,31621796,"2016-01-28","2016-01-01"]
[2016,42370,"BRZEZINY",1021011,1,null,520,"9.6.1",null,"   Dopuszczalny wskaźnik spłaty zobowiązań określony w art. 243 ustawy, po uwzględnieniu ustawowych wyłączeń, obliczony w oparciu o wykonanie roku poprzedzającego pierwszy rok prognozy (wskaźnik ustalony w oparciu o średnią arytmetyczną z 3 poprzednich lat) ",true,3,2019,8.6800000000000002E-2,"2016-01-28","2016-01-01"]
[2016,42370,"BRZEZINY",1021011,1,null,520,"9.6.1",null,"   Dopuszczalny wskaźnik spłaty zobowiązań określony w art. 243 ustawy, po uwzględnieniu ustawowych wyłączeń, obliczony w oparciu o wykonanie roku poprzedzającego pierwszy rok prognozy (wskaźnik ustalony w oparciu o średnią arytmetyczną z 3 poprzednich lat) ",true,0,2016,6.3799999999999996E-2,"2016-01-28","2016-01-01"]
[2016,42370,"BRZEZINY",1021011,1,null,520,"9.6.1",null,"   Dopuszczalny wskaźnik spłaty zobowiązań określony w art. 243 ustawy, po uwzględnieniu ustawowych wyłączeń, obliczony w oparciu o wykonanie roku poprzedzającego pierwszy rok prognozy (wskaźnik ustalony w oparciu o średnią arytmetyczną z 3 poprzednich lat) ",true,4,2020,9.9500000000000005E-2,"2016-01-28","2016-01-01"]
[2016,42370,"BRZEZINY",1021011,1,null,520,"9.6.1",null,"   Dopuszczalny wskaźnik spłaty zobowiązań określony w art. 243 ustawy, po uwzględnieniu ustawowych wyłączeń, obliczony w oparciu o wykonanie roku poprzedzającego pierwszy rok prognozy (wskaźnik ustalony w oparciu o średnią arytmetyczną z 3 poprzednich lat) ",true,6,2022,0.1217,"2016-01-28","2016-01-01"]
[2016,42370,"BRZEZINY",1021011,1,null,520,"9.6.1",null,"   Dopuszczalny wskaźnik spłaty zobowiązań określony w art. 243 ustawy, po uwzględnieniu ustawowych wyłączeń, obliczony w oparciu o wykonanie roku poprzedzającego pierwszy rok prognozy (wskaźnik ustalony w oparciu o średnią arytmetyczną z 3 poprzednich lat) ",true,5,2021,0.1109,"2016-01-28","2016-01-01"]
[2016,42370,"BRZEZINY",1021011,1,null,520,"9.6.1",null,"   Dopuszczalny wskaźnik spłaty zobowiązań określony w art. 243 ustawy, po uwzględnieniu ustawowych wyłączeń, obliczony w oparciu o wykonanie roku poprzedzającego pierwszy rok prognozy (wskaźnik ustalony w oparciu o średnią arytmetyczną z 3 poprzednich lat) ",true,7,2023,0.13189999999999999,"2016-01-28","2016-01-01"]
[2016,42370,"BRZEZINY",1021011,1,null,520,"9.6.1",null,"   Dopuszczalny wskaźnik spłaty zobowiązań określony w art. 243 ustawy, po uwzględnieniu ustawowych wyłączeń, obliczony w oparciu o wykonanie roku poprzedzającego pierwszy rok prognozy (wskaźnik ustalony w oparciu o średnią arytmetyczną z 3 poprzednich lat) ",true,8,2024,0.1416,"2016-01-28","2016-01-01"]
[2016,42370,"BRZEZINY",1021011,1,null,520,"9.6.1",null,"   Dopuszczalny wskaźnik spłaty zobowiązań określony w art. 243 ustawy, po uwzględnieniu ustawowych wyłączeń, obliczony w oparciu o wykonanie roku poprzedzającego pierwszy rok prognozy (wskaźnik ustalony w oparciu o średnią arytmetyczną z 3 poprzednich lat) ",true,1,2017,6.7199999999999996E-2,"2016-01-28","2016-01-01"]
[2016,42370,"BRZEZINY",1021011,1,null,520,"9.6.1",null,"   Dopuszczalny wskaźnik spłaty zobowiązań określony w art. 243 ustawy, po uwzględnieniu ustawowych wyłączeń, obliczony w oparciu o wykonanie roku poprzedzającego pierwszy rok prognozy (wskaźnik ustalony w oparciu o średnią arytmetyczną z 3 poprzednich lat) ",true,2,2018,7.0000000000000007E-2,"2016-01-28","2016-01-01"]
[2016,42370,"BRZEZINY",1021011,1,null,170,"2.1.3",null,"  wydatki na obsługę długu, w tym:",true,8,2024,40000,"2016-01-28","2016-01-01"]
[2016,42370,"BRZEZINY",1021011,1,null,170,"2.1.3",null,"  wydatki na obsługę długu, w tym:",true,6,2022,210000,"2016-01-28","2016-01-01"]
[2016,42370,"BRZEZINY",1021011,1,null,170,"2.1.3",null,"  wydatki na obsługę długu, w tym:",true,4,2020,380000,"2016-01-28","2016-01-01"]
[2016,42370,"BRZEZINY",1021011,1,null,170,"2.1.3",null,"  wydatki na obsługę długu, w tym:",true,3,2019,440000,"2016-01-28","2016-01-01"]
[2016,42370,"BRZEZINY",1021011,1,null,170,"2.1.3",null,"  wydatki na obsługę długu, w tym:",true,5,2021,300000,"2016-01-28","2016-01-01"]
[2016,42370,"BRZEZINY",1021011,1,null,170,"2.1.3",null,"  wydatki na obsługę długu, w tym:",true,2,2018,470000,"2016-01-28","2016-01-01"]
[2016,42370,"BRZEZINY",1021011,1,null,170,"2.1.3",null,"  wydatki na obsługę długu, w tym:",true,0,2016,505000,"2016-01-28","2016-01-01"]
[2016,42370,"BRZEZINY",1021011,1,null,170,"2.1.3",null,"  wydatki na obsługę długu, w tym:",true,1,2017,500000,"2016-01-28","2016-01-01"]
[2016,42370,"BRZEZINY",1021011,1,null,170,"2.1.3",null,"  wydatki na obsługę długu, w tym:",true,7,2023,130000,"2016-01-28","2016-01-01"]
[2016,42370,"BRZEZINY",1021011,1,null,761,"12.4.1",null,"  -  w tym finansowane środkami określonymi w art. 5 ust. 1 pkt 2 ustawy",true,6,2022,0,"2016-01-28","2016-01-01"]
[2016,42370,"BRZEZINY",1021011,1,null,761,"12.4.1",null,"  -  w tym finansowane środkami określonymi w art. 5 ust. 1 pkt 2 ustawy",true,2,2018,0,"2016-01-28","2016-01-01"]
[2016,42370,"BRZEZINY",1021011,1,null,761,"12.4.1",null,"  -  w tym finansowane środkami określonymi w art. 5 ust. 1 pkt 2 ustawy",true,5,2021,0,"2016-01-28","2016-01-01"]
[2016,42370,"BRZEZINY",1021011,1,null,761,"12.4.1",null,"  -  w tym finansowane środkami określonymi w art. 5 ust. 1 pkt 2 ustawy",true,1,2017,0,"2016-01-28","2016-01-01"]
[2016,42370,"BRZEZINY",1021011,1,null,761,"12.4.1",null,"  -  w tym finansowane środkami określonymi w art. 5 ust. 1 pkt 2 ustawy",true,7,2023,0,"2016-01-28","2016-01-01"]
[2016,42370,"BRZEZINY",1021011,1,null,761,"12.4.1",null,"  -  w tym finansowane środkami określonymi w art. 5 ust. 1 pkt 2 ustawy",true,4,2020,0,"2016-01-28","2016-01-01"]
[2016,42370,"BRZEZINY",1021011,1,null,761,"12.4.1",null,"  -  w tym finansowane środkami określonymi w art. 5 ust. 1 pkt 2 ustawy",true,0,2016,0,"2016-01-28","2016-01-01"]
[2016,42370,"BRZEZINY",1021011,1,null,761,"12.4.1",null,"  -  w tym finansowane środkami określonymi w art. 5 ust. 1 pkt 2 ustawy",true,3,2019,0,"2016-01-28","2016-01-01"]
[2016,42370,"BRZEZINY",1021011,1,null,761,"12.4.1",null,"  -  w tym finansowane środkami określonymi w art. 5 ust. 1 pkt 2 ustawy",true,8,2024,0,"2016-01-28","2016-01-01"]
[2016,42370,"BRZEZINY",1021011,1,null,310,5.0999999999999996,null," Spłaty rat kapitałowych kredytów i pożyczek oraz wykup papierów wartościowych",true,8,2024,3418384,"2016-01-28","2016-01-01"]
[2016,42370,"BRZEZINY",1021011,1,null,310,5.0999999999999996,null," Spłaty rat kapitałowych kredytów i pożyczek oraz wykup papierów wartościowych",true,2,2018,1678204,"2016-01-28","2016-01-01"]
[2016,42370,"BRZEZINY",1021011,1,null,310,5.0999999999999996,null," Spłaty rat kapitałowych kredytów i pożyczek oraz wykup papierów wartościowych",true,5,2021,2210004,"2016-01-28","2016-01-01"]
[2016,42370,"BRZEZINY",1021011,1,null,310,5.0999999999999996,null," Spłaty rat kapitałowych kredytów i pożyczek oraz wykup papierów wartościowych",true,3,2019,1860004,"2016-01-28","2016-01-01"]
[2016,42370,"BRZEZINY",1021011,1,null,310,5.0999999999999996,null," Spłaty rat kapitałowych kredytów i pożyczek oraz wykup papierów wartościowych",true,1,2017,1478204,"2016-01-28","2016-01-01"]
[2016,42370,"BRZEZINY",1021011,1,null,310,5.0999999999999996,null," Spłaty rat kapitałowych kredytów i pożyczek oraz wykup papierów wartościowych",true,0,2016,1215692,"2016-01-28","2016-01-01"]
[2016,42370,"BRZEZINY",1021011,1,null,310,5.0999999999999996,null," Spłaty rat kapitałowych kredytów i pożyczek oraz wykup papierów wartościowych",true,4,2020,2210004,"2016-01-28","2016-01-01"]
[2016,42370,"BRZEZINY",1021011,1,null,310,5.0999999999999996,null," Spłaty rat kapitałowych kredytów i pożyczek oraz wykup papierów wartościowych",true,6,2022,2250004,"2016-01-28","2016-01-01"]
[2016,42370,"BRZEZINY",1021011,1,null,310,5.0999999999999996,null," Spłaty rat kapitałowych kredytów i pożyczek oraz wykup papierów wartościowych",true,7,2023,2418000,"2016-01-28","2016-01-01"]
[2016,42370,"BRZEZINY",1021011,1,null,80,"1.1.5",null,"  z tytułu dotacji i środków przeznaczonych na cele bieżące",true,2,2018,5200000,"2016-01-28","2016-01-01"]
[2016,42370,"BRZEZINY",1021011,1,null,80,"1.1.5",null,"  z tytułu dotacji i środków przeznaczonych na cele bieżące",true,7,2023,0,"2016-01-28","2016-01-01"]
[2016,42370,"BRZEZINY",1021011,1,null,80,"1.1.5",null,"  z tytułu dotacji i środków przeznaczonych na cele bieżące",true,4,2020,0,"2016-01-28","2016-01-01"]
[2016,42370,"BRZEZINY",1021011,1,null,80,"1.1.5",null,"  z tytułu dotacji i środków przeznaczonych na cele bieżące",true,0,2016,5085967,"2016-01-28","2016-01-01"]
[2016,42370,"BRZEZINY",1021011,1,null,80,"1.1.5",null,"  z tytułu dotacji i środków przeznaczonych na cele bieżące",true,8,2024,0,"2016-01-28","2016-01-01"]
[2016,42370,"BRZEZINY",1021011,1,null,80,"1.1.5",null,"  z tytułu dotacji i środków przeznaczonych na cele bieżące",true,5,2021,0,"2016-01-28","2016-01-01"]
[2016,42370,"BRZEZINY",1021011,1,null,80,"1.1.5",null,"  z tytułu dotacji i środków przeznaczonych na cele bieżące",true,1,2017,5100000,"2016-01-28","2016-01-01"]
[2016,42370,"BRZEZINY",1021011,1,null,80,"1.1.5",null,"  z tytułu dotacji i środków przeznaczonych na cele bieżące",true,3,2019,5300000,"2016-01-28","2016-01-01"]
[2016,42370,"BRZEZINY",1021011,1,null,80,"1.1.5",null,"  z tytułu dotacji i środków przeznaczonych na cele bieżące",true,6,2022,0,"2016-01-28","2016-01-01"]
[2016,42370,"BRZEZINY",1021011,1,null,760,12.4,null," Wydatki majątkowe na programy, projekty lub zadania finansowane z udziałem środków, o których mowa w art. 5 ust. 1 pkt 2 i 3 ustawy",true,7,2023,0,"2016-01-28","2016-01-01"]
[2016,42370,"BRZEZINY",1021011,1,null,760,12.4,null," Wydatki majątkowe na programy, projekty lub zadania finansowane z udziałem środków, o których mowa w art. 5 ust. 1 pkt 2 i 3 ustawy",true,5,2021,0,"2016-01-28","2016-01-01"]
[2016,42370,"BRZEZINY",1021011,1,null,760,12.4,null," Wydatki majątkowe na programy, projekty lub zadania finansowane z udziałem środków, o których mowa w art. 5 ust. 1 pkt 2 i 3 ustawy",true,1,2017,0,"2016-01-28","2016-01-01"]
[2016,42370,"BRZEZINY",1021011,1,null,760,12.4,null," Wydatki majątkowe na programy, projekty lub zadania finansowane z udziałem środków, o których mowa w art. 5 ust. 1 pkt 2 i 3 ustawy",true,6,2022,0,"2016-01-28","2016-01-01"]
[2016,42370,"BRZEZINY",1021011,1,null,760,12.4,null," Wydatki majątkowe na programy, projekty lub zadania finansowane z udziałem środków, o których mowa w art. 5 ust. 1 pkt 2 i 3 ustawy",true,0,2016,0,"2016-01-28","2016-01-01"]
[2016,42370,"BRZEZINY",1021011,1,null,760,12.4,null," Wydatki majątkowe na programy, projekty lub zadania finansowane z udziałem środków, o których mowa w art. 5 ust. 1 pkt 2 i 3 ustawy",true,4,2020,0,"2016-01-28","2016-01-01"]
[2016,42370,"BRZEZINY",1021011,1,null,760,12.4,null," Wydatki majątkowe na programy, projekty lub zadania finansowane z udziałem środków, o których mowa w art. 5 ust. 1 pkt 2 i 3 ustawy",true,2,2018,0,"2016-01-28","2016-01-01"]
[2016,42370,"BRZEZINY",1021011,1,null,760,12.4,null," Wydatki majątkowe na programy, projekty lub zadania finansowane z udziałem środków, o których mowa w art. 5 ust. 1 pkt 2 i 3 ustawy",true,3,2019,0,"2016-01-28","2016-01-01"]
[2016,42370,"BRZEZINY",1021011,1,null,760,12.4,null," Wydatki majątkowe na programy, projekty lub zadania finansowane z udziałem środków, o których mowa w art. 5 ust. 1 pkt 2 i 3 ustawy",true,8,2024,0,"2016-01-28","2016-01-01"]
[2016,42370,"BRZEZINY",1021011,1,null,640,11.5,null," Nowe wydatki inwestycyjne",true,7,2023,0,"2016-01-28","2016-01-01"]
[2016,42370,"BRZEZINY",1021011,1,null,640,11.5,null," Nowe wydatki inwestycyjne",true,2,2018,0,"2016-01-28","2016-01-01"]
[2016,42370,"BRZEZINY",1021011,1,null,640,11.5,null," Nowe wydatki inwestycyjne",true,3,2019,0,"2016-01-28","2016-01-01"]
[2016,42370,"BRZEZINY",1021011,1,null,640,11.5,null," Nowe wydatki inwestycyjne",true,6,2022,0,"2016-01-28","2016-01-01"]
[2016,42370,"BRZEZINY",1021011,1,null,640,11.5,null," Nowe wydatki inwestycyjne",true,4,2020,0,"2016-01-28","2016-01-01"]
[2016,42370,"BRZEZINY",1021011,1,null,640,11.5,null," Nowe wydatki inwestycyjne",true,0,2016,520000,"2016-01-28","2016-01-01"]
[2016,42370,"BRZEZINY",1021011,1,null,640,11.5,null," Nowe wydatki inwestycyjne",true,5,2021,0,"2016-01-28","2016-01-01"]
[2016,42370,"BRZEZINY",1021011,1,null,640,11.5,null," Nowe wydatki inwestycyjne",true,8,2024,0,"2016-01-28","2016-01-01"]
[2016,42370,"BRZEZINY",1021011,1,null,640,11.5,null," Nowe wydatki inwestycyjne",true,1,2017,0,"2016-01-28","2016-01-01"]
[2016,42370,"BRZEZINY",1021011,1,null,250,"4.2.1",null,"   w tym na pokrycie deficytu budżetu",false,0,2016,0,"2016-01-28","2016-01-01"]
[2016,42370,"BRZEZINY",1021011,1,null,250,"4.2.1",null,"   w tym na pokrycie deficytu budżetu",false,1,2017,0,"2016-01-28","2016-01-01"]
[2016,42370,"BRZEZINY",1021011,1,null,250,"4.2.1",null,"   w tym na pokrycie deficytu budżetu",false,2,2018,0,"2016-01-28","2016-01-01"]
[2016,42370,"BRZEZINY",1021011,1,null,250,"4.2.1",null,"   w tym na pokrycie deficytu budżetu",false,7,2023,0,"2016-01-28","2016-01-01"]
[2016,42370,"BRZEZINY",1021011,1,null,250,"4.2.1",null,"   w tym na pokrycie deficytu budżetu",false,6,2022,0,"2016-01-28","2016-01-01"]
[2016,42370,"BRZEZINY",1021011,1,null,250,"4.2.1",null,"   w tym na pokrycie deficytu budżetu",false,4,2020,0,"2016-01-28","2016-01-01"]
[2016,42370,"BRZEZINY",1021011,1,null,250,"4.2.1",null,"   w tym na pokrycie deficytu budżetu",false,5,2021,0,"2016-01-28","2016-01-01"]
[2016,42370,"BRZEZINY",1021011,1,null,250,"4.2.1",null,"   w tym na pokrycie deficytu budżetu",false,8,2024,0,"2016-01-28","2016-01-01"]
[2016,42370,"BRZEZINY",1021011,1,null,250,"4.2.1",null,"   w tym na pokrycie deficytu budżetu",false,3,2019,0,"2016-01-28","2016-01-01"]
[2016,42370,"BRZEZINY",1021011,1,null,1010,16.2,null," Stopień niezachowania wskaźnika spłaty zobowiązań, o którym mowa w poz. 9.7.",true,1,2017,0,"2016-01-28","2016-01-01"]
[2016,42370,"BRZEZINY",1021011,1,null,1010,16.2,null," Stopień niezachowania wskaźnika spłaty zobowiązań, o którym mowa w poz. 9.7.",true,0,2016,0,"2016-01-28","2016-01-01"]
[2016,42370,"BRZEZINY",1021011,1,null,1010,16.2,null," Stopień niezachowania wskaźnika spłaty zobowiązań, o którym mowa w poz. 9.7.",true,8,2024,0,"2016-01-28","2016-01-01"]
[2016,42370,"BRZEZINY",1021011,1,null,1010,16.2,null," Stopień niezachowania wskaźnika spłaty zobowiązań, o którym mowa w poz. 9.7.",true,6,2022,0,"2016-01-28","2016-01-01"]
[2016,42370,"BRZEZINY",1021011,1,null,1010,16.2,null," Stopień niezachowania wskaźnika spłaty zobowiązań, o którym mowa w poz. 9.7.",true,4,2020,0,"2016-01-28","2016-01-01"]
[2016,42370,"BRZEZINY",1021011,1,null,1010,16.2,null," Stopień niezachowania wskaźnika spłaty zobowiązań, o którym mowa w poz. 9.7.",true,5,2021,0,"2016-01-28","2016-01-01"]
[2016,42370,"BRZEZINY",1021011,1,null,1010,16.2,null," Stopień niezachowania wskaźnika spłaty zobowiązań, o którym mowa w poz. 9.7.",true,3,2019,0,"2016-01-28","2016-01-01"]
[2016,42370,"BRZEZINY",1021011,1,null,1010,16.2,null," Stopień niezachowania wskaźnika spłaty zobowiązań, o którym mowa w poz. 9.7.",true,2,2018,0,"2016-01-28","2016-01-01"]
[2016,42370,"BRZEZINY",1021011,1,null,1010,16.2,null," Stopień niezachowania wskaźnika spłaty zobowiązań, o którym mowa w poz. 9.7.",true,7,2023,0,"2016-01-28","2016-01-01"]
[2016,42370,"BRZEZINY",1021011,1,null,980,15.2,null," Wydatki bieżące z tytułu świadczenia emitenta należnego obligatariuszom,  nieuwzględniane  w limicie spłaty zobowiązań, o którym mowa w art. 243 ustawy",true,5,2021,0,"2016-01-28","2016-01-01"]
[2016,42370,"BRZEZINY",1021011,1,null,980,15.2,null," Wydatki bieżące z tytułu świadczenia emitenta należnego obligatariuszom,  nieuwzględniane  w limicie spłaty zobowiązań, o którym mowa w art. 243 ustawy",true,1,2017,0,"2016-01-28","2016-01-01"]
[2016,42370,"BRZEZINY",1021011,1,null,980,15.2,null," Wydatki bieżące z tytułu świadczenia emitenta należnego obligatariuszom,  nieuwzględniane  w limicie spłaty zobowiązań, o którym mowa w art. 243 ustawy",true,7,2023,0,"2016-01-28","2016-01-01"]
[2016,42370,"BRZEZINY",1021011,1,null,980,15.2,null," Wydatki bieżące z tytułu świadczenia emitenta należnego obligatariuszom,  nieuwzględniane  w limicie spłaty zobowiązań, o którym mowa w art. 243 ustawy",true,6,2022,0,"2016-01-28","2016-01-01"]
[2016,42370,"BRZEZINY",1021011,1,null,980,15.2,null," Wydatki bieżące z tytułu świadczenia emitenta należnego obligatariuszom,  nieuwzględniane  w limicie spłaty zobowiązań, o którym mowa w art. 243 ustawy",true,0,2016,0,"2016-01-28","2016-01-01"]
[2016,42370,"BRZEZINY",1021011,1,null,980,15.2,null," Wydatki bieżące z tytułu świadczenia emitenta należnego obligatariuszom,  nieuwzględniane  w limicie spłaty zobowiązań, o którym mowa w art. 243 ustawy",true,2,2018,0,"2016-01-28","2016-01-01"]
[2016,42370,"BRZEZINY",1021011,1,null,980,15.2,null," Wydatki bieżące z tytułu świadczenia emitenta należnego obligatariuszom,  nieuwzględniane  w limicie spłaty zobowiązań, o którym mowa w art. 243 ustawy",true,3,2019,0,"2016-01-28","2016-01-01"]
[2016,42370,"BRZEZINY",1021011,1,null,980,15.2,null," Wydatki bieżące z tytułu świadczenia emitenta należnego obligatariuszom,  nieuwzględniane  w limicie spłaty zobowiązań, o którym mowa w art. 243 ustawy",true,4,2020,0,"2016-01-28","2016-01-01"]
[2016,42370,"BRZEZINY",1021011,1,null,980,15.2,null," Wydatki bieżące z tytułu świadczenia emitenta należnego obligatariuszom,  nieuwzględniane  w limicie spłaty zobowiązań, o którym mowa w art. 243 ustawy",true,8,2024,0,"2016-01-28","2016-01-01"]
[2016,42370,"BRZEZINY",1021011,1,null,290,"4.4.1",null,"   w tym na pokrycie deficytu budżetu",false,3,2019,0,"2016-01-28","2016-01-01"]
[2016,42370,"BRZEZINY",1021011,1,null,290,"4.4.1",null,"   w tym na pokrycie deficytu budżetu",false,6,2022,0,"2016-01-28","2016-01-01"]
[2016,42370,"BRZEZINY",1021011,1,null,290,"4.4.1",null,"   w tym na pokrycie deficytu budżetu",false,0,2016,0,"2016-01-28","2016-01-01"]
[2016,42370,"BRZEZINY",1021011,1,null,290,"4.4.1",null,"   w tym na pokrycie deficytu budżetu",false,2,2018,0,"2016-01-28","2016-01-01"]
[2016,42370,"BRZEZINY",1021011,1,null,290,"4.4.1",null,"   w tym na pokrycie deficytu budżetu",false,5,2021,0,"2016-01-28","2016-01-01"]
[2016,42370,"BRZEZINY",1021011,1,null,290,"4.4.1",null,"   w tym na pokrycie deficytu budżetu",false,1,2017,0,"2016-01-28","2016-01-01"]
[2016,42370,"BRZEZINY",1021011,1,null,290,"4.4.1",null,"   w tym na pokrycie deficytu budżetu",false,4,2020,0,"2016-01-28","2016-01-01"]
[2016,42370,"BRZEZINY",1021011,1,null,290,"4.4.1",null,"   w tym na pokrycie deficytu budżetu",false,8,2024,0,"2016-01-28","2016-01-01"]
[2016,42370,"BRZEZINY",1021011,1,null,290,"4.4.1",null,"   w tym na pokrycie deficytu budżetu",false,7,2023,0,"2016-01-28","2016-01-01"]
[2016,42370,"BRZEZINY",1021011,1,null,560,10.1,null," Spłaty kredytów, pożyczek i wykup papierów wartościowych",false,0,2016,0,"2016-01-28","2016-01-01"]
[2016,42370,"BRZEZINY",1021011,1,null,560,10.1,null," Spłaty kredytów, pożyczek i wykup papierów wartościowych",false,2,2018,1678204,"2016-01-28","2016-01-01"]
[2016,42370,"BRZEZINY",1021011,1,null,560,10.1,null," Spłaty kredytów, pożyczek i wykup papierów wartościowych",false,7,2023,2418000,"2016-01-28","2016-01-01"]
[2016,42370,"BRZEZINY",1021011,1,null,560,10.1,null," Spłaty kredytów, pożyczek i wykup papierów wartościowych",false,5,2021,2210004,"2016-01-28","2016-01-01"]
[2016,42370,"BRZEZINY",1021011,1,null,560,10.1,null," Spłaty kredytów, pożyczek i wykup papierów wartościowych",false,6,2022,2250004,"2016-01-28","2016-01-01"]
[2016,42370,"BRZEZINY",1021011,1,null,560,10.1,null," Spłaty kredytów, pożyczek i wykup papierów wartościowych",false,8,2024,2465692,"2016-01-28","2016-01-01"]
[2016,42370,"BRZEZINY",1021011,1,null,560,10.1,null," Spłaty kredytów, pożyczek i wykup papierów wartościowych",false,1,2017,1478204,"2016-01-28","2016-01-01"]
[2016,42370,"BRZEZINY",1021011,1,null,560,10.1,null," Spłaty kredytów, pożyczek i wykup papierów wartościowych",false,3,2019,1860004,"2016-01-28","2016-01-01"]
[2016,42370,"BRZEZINY",1021011,1,null,560,10.1,null," Spłaty kredytów, pożyczek i wykup papierów wartościowych",false,4,2020,2210004,"2016-01-28","2016-01-01"]
[2016,42370,"BRZEZINY",1021011,1,null,90,1.2,null,"  Dochody majątkowe, w tym",true,0,2016,130000,"2016-01-28","2016-01-01"]
[2016,42370,"BRZEZINY",1021011,1,null,90,1.2,null,"  Dochody majątkowe, w tym",true,3,2019,0,"2016-01-28","2016-01-01"]
[2016,42370,"BRZEZINY",1021011,1,null,90,1.2,null,"  Dochody majątkowe, w tym",true,4,2020,0,"2016-01-28","2016-01-01"]
[2016,42370,"BRZEZINY",1021011,1,null,90,1.2,null,"  Dochody majątkowe, w tym",true,8,2024,0,"2016-01-28","2016-01-01"]
[2016,42370,"BRZEZINY",1021011,1,null,90,1.2,null,"  Dochody majątkowe, w tym",true,1,2017,0,"2016-01-28","2016-01-01"]
[2016,42370,"BRZEZINY",1021011,1,null,90,1.2,null,"  Dochody majątkowe, w tym",true,7,2023,0,"2016-01-28","2016-01-01"]
[2016,42370,"BRZEZINY",1021011,1,null,90,1.2,null,"  Dochody majątkowe, w tym",true,2,2018,0,"2016-01-28","2016-01-01"]
[2016,42370,"BRZEZINY",1021011,1,null,90,1.2,null,"  Dochody majątkowe, w tym",true,5,2021,0,"2016-01-28","2016-01-01"]
[2016,42370,"BRZEZINY",1021011,1,null,90,1.2,null,"  Dochody majątkowe, w tym",true,6,2022,0,"2016-01-28","2016-01-01"]
[2016,42370,"BRZEZINY",1021011,1,null,480,9.1999999999999993,"( ([2.1.1]-[2.1.1.1])+([2.1.3.1]-[2.1.3.1.1]-[2.1.3.1.2])+([5.1]-[5.1.1]) )/([1]-[15.1.1])"," Wskaźnik planowanej łącznej kwoty spłaty zobowiązań, o której mowa w art. 243 ust. 1 ustawy do dochodów, bez uwzględnienia zobowiązań związku współtworzonego przez jednostkę samorządu terytorialnego, po uwzględnieniu ustawowych wyłączeń przypadających na dany rok.",false,7,2023,6.8400000000000002E-2,"2016-01-28","2016-01-01"]
[2016,42370,"BRZEZINY",1021011,1,null,480,9.1999999999999993,"( ([2.1.1]-[2.1.1.1])+([2.1.3.1]-[2.1.3.1.1]-[2.1.3.1.2])+([5.1]-[5.1.1]) )/([1]-[15.1.1])"," Wskaźnik planowanej łącznej kwoty spłaty zobowiązań, o której mowa w art. 243 ust. 1 ustawy do dochodów, bez uwzględnienia zobowiązań związku współtworzonego przez jednostkę samorządu terytorialnego, po uwzględnieniu ustawowych wyłączeń przypadających na dany rok.",false,1,2017,6.3200000000000006E-2,"2016-01-28","2016-01-01"]
[2016,42370,"BRZEZINY",1021011,1,null,480,9.1999999999999993,"( ([2.1.1]-[2.1.1.1])+([2.1.3.1]-[2.1.3.1.1]-[2.1.3.1.2])+([5.1]-[5.1.1]) )/([1]-[15.1.1])"," Wskaźnik planowanej łącznej kwoty spłaty zobowiązań, o której mowa w art. 243 ust. 1 ustawy do dochodów, bez uwzględnienia zobowiązań związku współtworzonego przez jednostkę samorządu terytorialnego, po uwzględnieniu ustawowych wyłączeń przypadających na dany rok.",false,8,2024,8.9399999999999993E-2,"2016-01-28","2016-01-01"]
[2016,42370,"BRZEZINY",1021011,1,null,480,9.1999999999999993,"( ([2.1.1]-[2.1.1.1])+([2.1.3.1]-[2.1.3.1.1]-[2.1.3.1.2])+([5.1]-[5.1.1]) )/([1]-[15.1.1])"," Wskaźnik planowanej łącznej kwoty spłaty zobowiązań, o której mowa w art. 243 ust. 1 ustawy do dochodów, bez uwzględnienia zobowiązań związku współtworzonego przez jednostkę samorządu terytorialnego, po uwzględnieniu ustawowych wyłączeń przypadających na dany rok.",false,0,2016,5.6800000000000003E-2,"2016-01-28","2016-01-01"]
[2016,42370,"BRZEZINY",1021011,1,null,480,9.1999999999999993,"( ([2.1.1]-[2.1.1.1])+([2.1.3.1]-[2.1.3.1.1]-[2.1.3.1.2])+([5.1]-[5.1.1]) )/([1]-[15.1.1])"," Wskaźnik planowanej łącznej kwoty spłaty zobowiązań, o której mowa w art. 243 ust. 1 ustawy do dochodów, bez uwzględnienia zobowiązań związku współtworzonego przez jednostkę samorządu terytorialnego, po uwzględnieniu ustawowych wyłączeń przypadających na dany rok.",false,5,2021,7.0900000000000005E-2,"2016-01-28","2016-01-01"]
[2016,42370,"BRZEZINY",1021011,1,null,480,9.1999999999999993,"( ([2.1.1]-[2.1.1.1])+([2.1.3.1]-[2.1.3.1.1]-[2.1.3.1.2])+([5.1]-[5.1.1]) )/([1]-[15.1.1])"," Wskaźnik planowanej łącznej kwoty spłaty zobowiązań, o której mowa w art. 243 ust. 1 ustawy do dochodów, bez uwzględnienia zobowiązań związku współtworzonego przez jednostkę samorządu terytorialnego, po uwzględnieniu ustawowych wyłączeń przypadających na dany rok.",false,2,2018,6.6400000000000001E-2,"2016-01-28","2016-01-01"]
[2016,42370,"BRZEZINY",1021011,1,null,480,9.1999999999999993,"( ([2.1.1]-[2.1.1.1])+([2.1.3.1]-[2.1.3.1.1]-[2.1.3.1.2])+([5.1]-[5.1.1]) )/([1]-[15.1.1])"," Wskaźnik planowanej łącznej kwoty spłaty zobowiązań, o której mowa w art. 243 ust. 1 ustawy do dochodów, bez uwzględnienia zobowiązań związku współtworzonego przez jednostkę samorządu terytorialnego, po uwzględnieniu ustawowych wyłączeń przypadających na dany rok.",false,6,2022,6.7799999999999999E-2,"2016-01-28","2016-01-01"]
[2016,42370,"BRZEZINY",1021011,1,null,480,9.1999999999999993,"( ([2.1.1]-[2.1.1.1])+([2.1.3.1]-[2.1.3.1.1]-[2.1.3.1.2])+([5.1]-[5.1.1]) )/([1]-[15.1.1])"," Wskaźnik planowanej łącznej kwoty spłaty zobowiązań, o której mowa w art. 243 ust. 1 ustawy do dochodów, bez uwzględnienia zobowiązań związku współtworzonego przez jednostkę samorządu terytorialnego, po uwzględnieniu ustawowych wyłączeń przypadających na dany rok.",false,4,2020,7.4999999999999997E-2,"2016-01-28","2016-01-01"]
[2016,42370,"BRZEZINY",1021011,1,null,480,9.1999999999999993,"( ([2.1.1]-[2.1.1.1])+([2.1.3.1]-[2.1.3.1.1]-[2.1.3.1.2])+([5.1]-[5.1.1]) )/([1]-[15.1.1])"," Wskaźnik planowanej łącznej kwoty spłaty zobowiązań, o której mowa w art. 243 ust. 1 ustawy do dochodów, bez uwzględnienia zobowiązań związku współtworzonego przez jednostkę samorządu terytorialnego, po uwzględnieniu ustawowych wyłączeń przypadających na dany rok.",false,3,2019,6.8900000000000003E-2,"2016-01-28","2016-01-01"]
[2016,42370,"BRZEZINY",1021011,1,null,820,13.3,null," Wysokość zobowiązań podlegających umorzeniu, o którym mowa w art. 190 ustawy o działalności leczniczej",true,8,2024,0,"2016-01-28","2016-01-01"]
[2016,42370,"BRZEZINY",1021011,1,null,820,13.3,null," Wysokość zobowiązań podlegających umorzeniu, o którym mowa w art. 190 ustawy o działalności leczniczej",true,0,2016,0,"2016-01-28","2016-01-01"]
[2016,42370,"BRZEZINY",1021011,1,null,820,13.3,null," Wysokość zobowiązań podlegających umorzeniu, o którym mowa w art. 190 ustawy o działalności leczniczej",true,1,2017,0,"2016-01-28","2016-01-01"]
[2016,42370,"BRZEZINY",1021011,1,null,820,13.3,null," Wysokość zobowiązań podlegających umorzeniu, o którym mowa w art. 190 ustawy o działalności leczniczej",true,5,2021,0,"2016-01-28","2016-01-01"]
[2016,42370,"BRZEZINY",1021011,1,null,820,13.3,null," Wysokość zobowiązań podlegających umorzeniu, o którym mowa w art. 190 ustawy o działalności leczniczej",true,3,2019,0,"2016-01-28","2016-01-01"]
[2016,42370,"BRZEZINY",1021011,1,null,820,13.3,null," Wysokość zobowiązań podlegających umorzeniu, o którym mowa w art. 190 ustawy o działalności leczniczej",true,7,2023,0,"2016-01-28","2016-01-01"]
[2016,42370,"BRZEZINY",1021011,1,null,820,13.3,null," Wysokość zobowiązań podlegających umorzeniu, o którym mowa w art. 190 ustawy o działalności leczniczej",true,2,2018,0,"2016-01-28","2016-01-01"]
[2016,42370,"BRZEZINY",1021011,1,null,820,13.3,null," Wysokość zobowiązań podlegających umorzeniu, o którym mowa w art. 190 ustawy o działalności leczniczej",true,6,2022,0,"2016-01-28","2016-01-01"]
[2016,42370,"BRZEZINY",1021011,1,null,820,13.3,null," Wysokość zobowiązań podlegających umorzeniu, o którym mowa w art. 190 ustawy o działalności leczniczej",true,4,2020,0,"2016-01-28","2016-01-01"]
[2016,42370,"BRZEZINY",1021011,1,null,30,"1.1.1",null,"  dochody z tytułu udziału we wpływach z podatku dochodowego od osób fizycznych",true,8,2024,0,"2016-01-28","2016-01-01"]
[2016,42370,"BRZEZINY",1021011,1,null,30,"1.1.1",null,"  dochody z tytułu udziału we wpływach z podatku dochodowego od osób fizycznych",true,5,2021,0,"2016-01-28","2016-01-01"]
[2016,42370,"BRZEZINY",1021011,1,null,30,"1.1.1",null,"  dochody z tytułu udziału we wpływach z podatku dochodowego od osób fizycznych",true,2,2018,9500000,"2016-01-28","2016-01-01"]
[2016,42370,"BRZEZINY",1021011,1,null,30,"1.1.1",null,"  dochody z tytułu udziału we wpływach z podatku dochodowego od osób fizycznych",true,1,2017,9000000,"2016-01-28","2016-01-01"]
[2016,42370,"BRZEZINY",1021011,1,null,30,"1.1.1",null,"  dochody z tytułu udziału we wpływach z podatku dochodowego od osób fizycznych",true,4,2020,0,"2016-01-28","2016-01-01"]
[2016,42370,"BRZEZINY",1021011,1,null,30,"1.1.1",null,"  dochody z tytułu udziału we wpływach z podatku dochodowego od osób fizycznych",true,6,2022,0,"2016-01-28","2016-01-01"]
[2016,42370,"BRZEZINY",1021011,1,null,30,"1.1.1",null,"  dochody z tytułu udziału we wpływach z podatku dochodowego od osób fizycznych",true,3,2019,10000000,"2016-01-28","2016-01-01"]
[2016,42370,"BRZEZINY",1021011,1,null,30,"1.1.1",null,"  dochody z tytułu udziału we wpływach z podatku dochodowego od osób fizycznych",true,0,2016,8400000,"2016-01-28","2016-01-01"]
[2016,42370,"BRZEZINY",1021011,1,null,30,"1.1.1",null,"  dochody z tytułu udziału we wpływach z podatku dochodowego od osób fizycznych",true,7,2023,0,"2016-01-28","2016-01-01"]
[2016,42370,"BRZEZINY",1021011,1,null,200,3,"[1] -[2]","Wynik budżetu",false,5,2021,2210004,"2016-01-28","2016-01-01"]
[2016,42370,"BRZEZINY",1021011,1,null,200,3,"[1] -[2]","Wynik budżetu",false,4,2020,2210004,"2016-01-28","2016-01-01"]
[2016,42370,"BRZEZINY",1021011,1,null,200,3,"[1] -[2]","Wynik budżetu",false,6,2022,2250004,"2016-01-28","2016-01-01"]
[2016,42370,"BRZEZINY",1021011,1,null,200,3,"[1] -[2]","Wynik budżetu",false,7,2023,2418000,"2016-01-28","2016-01-01"]
[2016,42370,"BRZEZINY",1021011,1,null,200,3,"[1] -[2]","Wynik budżetu",false,8,2024,3418384,"2016-01-28","2016-01-01"]
[2016,42370,"BRZEZINY",1021011,1,null,200,3,"[1] -[2]","Wynik budżetu",false,2,2018,1678204,"2016-01-28","2016-01-01"]
[2016,42370,"BRZEZINY",1021011,1,null,200,3,"[1] -[2]","Wynik budżetu",false,1,2017,1478204,"2016-01-28","2016-01-01"]
[2016,42370,"BRZEZINY",1021011,1,null,200,3,"[1] -[2]","Wynik budżetu",false,3,2019,1860004,"2016-01-28","2016-01-01"]
[2016,42370,"BRZEZINY",1021011,1,null,200,3,"[1] -[2]","Wynik budżetu",false,0,2016,0,"2016-01-28","2016-01-01"]
[2016,42370,"BRZEZINY",1021011,1,null,860,13.7,null," Wydatki bieżące na pokrycie ujemnego wyniku finansowego samodzielnego publicznego zakładu opieki zdrowotnej",true,5,2021,0,"2016-01-28","2016-01-01"]
[2016,42370,"BRZEZINY",1021011,1,null,860,13.7,null," Wydatki bieżące na pokrycie ujemnego wyniku finansowego samodzielnego publicznego zakładu opieki zdrowotnej",true,4,2020,0,"2016-01-28","2016-01-01"]
[2016,42370,"BRZEZINY",1021011,1,null,860,13.7,null," Wydatki bieżące na pokrycie ujemnego wyniku finansowego samodzielnego publicznego zakładu opieki zdrowotnej",true,3,2019,0,"2016-01-28","2016-01-01"]
[2016,42370,"BRZEZINY",1021011,1,null,860,13.7,null," Wydatki bieżące na pokrycie ujemnego wyniku finansowego samodzielnego publicznego zakładu opieki zdrowotnej",true,8,2024,0,"2016-01-28","2016-01-01"]
[2016,42370,"BRZEZINY",1021011,1,null,860,13.7,null," Wydatki bieżące na pokrycie ujemnego wyniku finansowego samodzielnego publicznego zakładu opieki zdrowotnej",true,2,2018,0,"2016-01-28","2016-01-01"]
[2016,42370,"BRZEZINY",1021011,1,null,860,13.7,null," Wydatki bieżące na pokrycie ujemnego wyniku finansowego samodzielnego publicznego zakładu opieki zdrowotnej",true,0,2016,0,"2016-01-28","2016-01-01"]
[2016,42370,"BRZEZINY",1021011,1,null,860,13.7,null," Wydatki bieżące na pokrycie ujemnego wyniku finansowego samodzielnego publicznego zakładu opieki zdrowotnej",true,1,2017,0,"2016-01-28","2016-01-01"]
[2016,42370,"BRZEZINY",1021011,1,null,860,13.7,null," Wydatki bieżące na pokrycie ujemnego wyniku finansowego samodzielnego publicznego zakładu opieki zdrowotnej",true,6,2022,0,"2016-01-28","2016-01-01"]
[2016,42370,"BRZEZINY",1021011,1,null,860,13.7,null," Wydatki bieżące na pokrycie ujemnego wyniku finansowego samodzielnego publicznego zakładu opieki zdrowotnej",true,7,2023,0,"2016-01-28","2016-01-01"]
[2016,42370,"BRZEZINY",1021011,1,null,60,"1.1.3.1",null,"   z podatku od nieruchomości",true,3,2019,4700000,"2016-01-28","2016-01-01"]
[2016,42370,"BRZEZINY",1021011,1,null,60,"1.1.3.1",null,"   z podatku od nieruchomości",true,8,2024,0,"2016-01-28","2016-01-01"]
[2016,42370,"BRZEZINY",1021011,1,null,60,"1.1.3.1",null,"   z podatku od nieruchomości",true,5,2021,0,"2016-01-28","2016-01-01"]
[2016,42370,"BRZEZINY",1021011,1,null,60,"1.1.3.1",null,"   z podatku od nieruchomości",true,6,2022,0,"2016-01-28","2016-01-01"]
[2016,42370,"BRZEZINY",1021011,1,null,60,"1.1.3.1",null,"   z podatku od nieruchomości",true,4,2020,0,"2016-01-28","2016-01-01"]
[2016,42370,"BRZEZINY",1021011,1,null,60,"1.1.3.1",null,"   z podatku od nieruchomości",true,7,2023,0,"2016-01-28","2016-01-01"]
[2016,42370,"BRZEZINY",1021011,1,null,60,"1.1.3.1",null,"   z podatku od nieruchomości",true,2,2018,4600000,"2016-01-28","2016-01-01"]
[2016,42370,"BRZEZINY",1021011,1,null,60,"1.1.3.1",null,"   z podatku od nieruchomości",true,0,2016,4400000,"2016-01-28","2016-01-01"]
[2016,42370,"BRZEZINY",1021011,1,null,60,"1.1.3.1",null,"   z podatku od nieruchomości",true,1,2017,4500000,"2016-01-28","2016-01-01"]
[2016,42370,"BRZEZINY",1021011,1,null,767,12.7,null," Przychody z tytułu kredytów, pożyczek, emisji papierów wartościowych powstające w związku z umową na realizację programu, projektu lub zadania finansowanego z udziałem środków, o których mowa w art. 5 ust. 1 pkt 2 ustawy bez względu na stopień finansowania tymi środkami ",true,7,2023,0,"2016-01-28","2016-01-01"]
[2016,42370,"BRZEZINY",1021011,1,null,767,12.7,null," Przychody z tytułu kredytów, pożyczek, emisji papierów wartościowych powstające w związku z umową na realizację programu, projektu lub zadania finansowanego z udziałem środków, o których mowa w art. 5 ust. 1 pkt 2 ustawy bez względu na stopień finansowania tymi środkami ",true,3,2019,0,"2016-01-28","2016-01-01"]
[2016,42370,"BRZEZINY",1021011,1,null,767,12.7,null," Przychody z tytułu kredytów, pożyczek, emisji papierów wartościowych powstające w związku z umową na realizację programu, projektu lub zadania finansowanego z udziałem środków, o których mowa w art. 5 ust. 1 pkt 2 ustawy bez względu na stopień finansowania tymi środkami ",true,2,2018,0,"2016-01-28","2016-01-01"]
[2016,42370,"BRZEZINY",1021011,1,null,767,12.7,null," Przychody z tytułu kredytów, pożyczek, emisji papierów wartościowych powstające w związku z umową na realizację programu, projektu lub zadania finansowanego z udziałem środków, o których mowa w art. 5 ust. 1 pkt 2 ustawy bez względu na stopień finansowania tymi środkami ",true,0,2016,0,"2016-01-28","2016-01-01"]
[2016,42370,"BRZEZINY",1021011,1,null,767,12.7,null," Przychody z tytułu kredytów, pożyczek, emisji papierów wartościowych powstające w związku z umową na realizację programu, projektu lub zadania finansowanego z udziałem środków, o których mowa w art. 5 ust. 1 pkt 2 ustawy bez względu na stopień finansowania tymi środkami ",true,1,2017,0,"2016-01-28","2016-01-01"]
[2016,42370,"BRZEZINY",1021011,1,null,1020,16.3,null," Stopień niezachowania wskaźnika spłaty zobowiązań, o którym mowa w poz. 9.7.1.",true,6,2022,0,"2016-01-28","2016-01-01"]
[2016,42370,"BRZEZINY",1021011,1,null,767,12.7,null," Przychody z tytułu kredytów, pożyczek, emisji papierów wartościowych powstające w związku z umową na realizację programu, projektu lub zadania finansowanego z udziałem środków, o których mowa w art. 5 ust. 1 pkt 2 ustawy bez względu na stopień finansowania tymi środkami ",true,4,2020,0,"2016-01-28","2016-01-01"]
[2016,42370,"BRZEZINY",1021011,1,null,767,12.7,null," Przychody z tytułu kredytów, pożyczek, emisji papierów wartościowych powstające w związku z umową na realizację programu, projektu lub zadania finansowanego z udziałem środków, o których mowa w art. 5 ust. 1 pkt 2 ustawy bez względu na stopień finansowania tymi środkami ",true,6,2022,0,"2016-01-28","2016-01-01"]
[2016,42370,"BRZEZINY",1021011,1,null,767,12.7,null," Przychody z tytułu kredytów, pożyczek, emisji papierów wartościowych powstające w związku z umową na realizację programu, projektu lub zadania finansowanego z udziałem środków, o których mowa w art. 5 ust. 1 pkt 2 ustawy bez względu na stopień finansowania tymi środkami ",true,5,2021,0,"2016-01-28","2016-01-01"]
[2016,42370,"BRZEZINY",1021011,1,null,767,12.7,null," Przychody z tytułu kredytów, pożyczek, emisji papierów wartościowych powstające w związku z umową na realizację programu, projektu lub zadania finansowanego z udziałem środków, o których mowa w art. 5 ust. 1 pkt 2 ustawy bez względu na stopień finansowania tymi środkami ",true,8,2024,0,"2016-01-28","2016-01-01"]
[2016,42370,"BRZEZINY",1021011,1,null,765,12.6,null," Wydatki na wkład krajowy w związku z zawartą po dniu 1 stycznia 2013 r. umową na realizację programu, projektu lub zadania finansowanego w co najmniej 60% środkami, o których mowa w art. 5 ust. 1 pkt 2 ustawy",true,8,2024,0,"2016-01-28","2016-01-01"]
[2016,42370,"BRZEZINY",1021011,1,null,765,12.6,null," Wydatki na wkład krajowy w związku z zawartą po dniu 1 stycznia 2013 r. umową na realizację programu, projektu lub zadania finansowanego w co najmniej 60% środkami, o których mowa w art. 5 ust. 1 pkt 2 ustawy",true,3,2019,0,"2016-01-28","2016-01-01"]
[2016,42370,"BRZEZINY",1021011,1,null,765,12.6,null," Wydatki na wkład krajowy w związku z zawartą po dniu 1 stycznia 2013 r. umową na realizację programu, projektu lub zadania finansowanego w co najmniej 60% środkami, o których mowa w art. 5 ust. 1 pkt 2 ustawy",true,4,2020,0,"2016-01-28","2016-01-01"]
[2016,42370,"BRZEZINY",1021011,1,null,765,12.6,null," Wydatki na wkład krajowy w związku z zawartą po dniu 1 stycznia 2013 r. umową na realizację programu, projektu lub zadania finansowanego w co najmniej 60% środkami, o których mowa w art. 5 ust. 1 pkt 2 ustawy",true,7,2023,0,"2016-01-28","2016-01-01"]
[2016,42370,"BRZEZINY",1021011,1,null,765,12.6,null," Wydatki na wkład krajowy w związku z zawartą po dniu 1 stycznia 2013 r. umową na realizację programu, projektu lub zadania finansowanego w co najmniej 60% środkami, o których mowa w art. 5 ust. 1 pkt 2 ustawy",true,6,2022,0,"2016-01-28","2016-01-01"]
[2016,42370,"BRZEZINY",1021011,1,null,765,12.6,null," Wydatki na wkład krajowy w związku z zawartą po dniu 1 stycznia 2013 r. umową na realizację programu, projektu lub zadania finansowanego w co najmniej 60% środkami, o których mowa w art. 5 ust. 1 pkt 2 ustawy",true,1,2017,0,"2016-01-28","2016-01-01"]
[2016,42370,"BRZEZINY",1021011,1,null,765,12.6,null," Wydatki na wkład krajowy w związku z zawartą po dniu 1 stycznia 2013 r. umową na realizację programu, projektu lub zadania finansowanego w co najmniej 60% środkami, o których mowa w art. 5 ust. 1 pkt 2 ustawy",true,0,2016,0,"2016-01-28","2016-01-01"]
[2016,42370,"BRZEZINY",1021011,1,null,765,12.6,null," Wydatki na wkład krajowy w związku z zawartą po dniu 1 stycznia 2013 r. umową na realizację programu, projektu lub zadania finansowanego w co najmniej 60% środkami, o których mowa w art. 5 ust. 1 pkt 2 ustawy",true,5,2021,0,"2016-01-28","2016-01-01"]
[2016,42370,"BRZEZINY",1021011,1,null,765,12.6,null," Wydatki na wkład krajowy w związku z zawartą po dniu 1 stycznia 2013 r. umową na realizację programu, projektu lub zadania finansowanego w co najmniej 60% środkami, o których mowa w art. 5 ust. 1 pkt 2 ustawy",true,2,2018,0,"2016-01-28","2016-01-01"]
[2016,42370,"BRZEZINY",1021011,1,null,1020,16.3,null," Stopień niezachowania wskaźnika spłaty zobowiązań, o którym mowa w poz. 9.7.1.",true,0,2016,0,"2016-01-28","2016-01-01"]
[2016,42370,"BRZEZINY",1021011,1,null,1020,16.3,null," Stopień niezachowania wskaźnika spłaty zobowiązań, o którym mowa w poz. 9.7.1.",true,3,2019,0,"2016-01-28","2016-01-01"]
[2016,42370,"BRZEZINY",1021011,1,null,1020,16.3,null," Stopień niezachowania wskaźnika spłaty zobowiązań, o którym mowa w poz. 9.7.1.",true,8,2024,0,"2016-01-28","2016-01-01"]
[2016,42370,"BRZEZINY",1021011,1,null,1020,16.3,null," Stopień niezachowania wskaźnika spłaty zobowiązań, o którym mowa w poz. 9.7.1.",true,5,2021,0,"2016-01-28","2016-01-01"]
[2016,42370,"BRZEZINY",1021011,1,null,1020,16.3,null," Stopień niezachowania wskaźnika spłaty zobowiązań, o którym mowa w poz. 9.7.1.",true,1,2017,0,"2016-01-28","2016-01-01"]
[2016,42370,"BRZEZINY",1021011,1,null,1020,16.3,null," Stopień niezachowania wskaźnika spłaty zobowiązań, o którym mowa w poz. 9.7.1.",true,7,2023,0,"2016-01-28","2016-01-01"]
[2016,42370,"BRZEZINY",1021011,1,null,1020,16.3,null," Stopień niezachowania wskaźnika spłaty zobowiązań, o którym mowa w poz. 9.7.1.",true,2,2018,0,"2016-01-28","2016-01-01"]
[2016,42370,"BRZEZINY",1021011,1,null,1020,16.3,null," Stopień niezachowania wskaźnika spłaty zobowiązań, o którym mowa w poz. 9.7.1.",true,4,2020,0,"2016-01-28","2016-01-01"]
[2016,42370,"BRZEZINY",1021011,1,null,670,12.1,null," Dochody bieżące  na programy, projekty lub zadania finansowane z udziałem środków, o których mowa w art. 5 ust. 1 pkt 2 i 3 ustawy",true,0,2016,0,"2016-01-28","2016-01-01"]
[2016,42370,"BRZEZINY",1021011,1,null,670,12.1,null," Dochody bieżące  na programy, projekty lub zadania finansowane z udziałem środków, o których mowa w art. 5 ust. 1 pkt 2 i 3 ustawy",true,6,2022,0,"2016-01-28","2016-01-01"]
[2016,42370,"BRZEZINY",1021011,1,null,670,12.1,null," Dochody bieżące  na programy, projekty lub zadania finansowane z udziałem środków, o których mowa w art. 5 ust. 1 pkt 2 i 3 ustawy",true,2,2018,0,"2016-01-28","2016-01-01"]
[2016,42370,"BRZEZINY",1021011,1,null,670,12.1,null," Dochody bieżące  na programy, projekty lub zadania finansowane z udziałem środków, o których mowa w art. 5 ust. 1 pkt 2 i 3 ustawy",true,1,2017,0,"2016-01-28","2016-01-01"]
[2016,42370,"BRZEZINY",1021011,1,null,670,12.1,null," Dochody bieżące  na programy, projekty lub zadania finansowane z udziałem środków, o których mowa w art. 5 ust. 1 pkt 2 i 3 ustawy",true,7,2023,0,"2016-01-28","2016-01-01"]
[2016,42370,"BRZEZINY",1021011,1,null,670,12.1,null," Dochody bieżące  na programy, projekty lub zadania finansowane z udziałem środków, o których mowa w art. 5 ust. 1 pkt 2 i 3 ustawy",true,3,2019,0,"2016-01-28","2016-01-01"]
[2016,42370,"BRZEZINY",1021011,1,null,670,12.1,null," Dochody bieżące  na programy, projekty lub zadania finansowane z udziałem środków, o których mowa w art. 5 ust. 1 pkt 2 i 3 ustawy",true,5,2021,0,"2016-01-28","2016-01-01"]
[2016,42370,"BRZEZINY",1021011,1,null,670,12.1,null," Dochody bieżące  na programy, projekty lub zadania finansowane z udziałem środków, o których mowa w art. 5 ust. 1 pkt 2 i 3 ustawy",true,4,2020,0,"2016-01-28","2016-01-01"]
[2016,42370,"BRZEZINY",1021011,1,null,670,12.1,null," Dochody bieżące  na programy, projekty lub zadania finansowane z udziałem środków, o których mowa w art. 5 ust. 1 pkt 2 i 3 ustawy",true,8,2024,0,"2016-01-28","2016-01-01"]
[2016,42370,"BRZEZINY",1021011,1,null,182,"2.1.3.1.1",null,"    odsetki i dyskonto podlegające wyłączeniu z limitu spłaty zobowiązań, o którym mowa w art. 243 ustawy, w terminie nie dłuższym niż 90 dni po zakończeniu programu, projektu lub zadania i otrzymaniu refundacji z tych środków (bez odsetek i dyskonta od zobowiązań na wkład krajowy)",false,1,2017,0,"2016-01-28","2016-01-01"]
[2016,42370,"BRZEZINY",1021011,1,null,182,"2.1.3.1.1",null,"    odsetki i dyskonto podlegające wyłączeniu z limitu spłaty zobowiązań, o którym mowa w art. 243 ustawy, w terminie nie dłuższym niż 90 dni po zakończeniu programu, projektu lub zadania i otrzymaniu refundacji z tych środków (bez odsetek i dyskonta od zobowiązań na wkład krajowy)",false,2,2018,0,"2016-01-28","2016-01-01"]
[2016,42370,"BRZEZINY",1021011,1,null,182,"2.1.3.1.1",null,"    odsetki i dyskonto podlegające wyłączeniu z limitu spłaty zobowiązań, o którym mowa w art. 243 ustawy, w terminie nie dłuższym niż 90 dni po zakończeniu programu, projektu lub zadania i otrzymaniu refundacji z tych środków (bez odsetek i dyskonta od zobowiązań na wkład krajowy)",false,0,2016,0,"2016-01-28","2016-01-01"]
[2016,42370,"BRZEZINY",1021011,1,null,182,"2.1.3.1.1",null,"    odsetki i dyskonto podlegające wyłączeniu z limitu spłaty zobowiązań, o którym mowa w art. 243 ustawy, w terminie nie dłuższym niż 90 dni po zakończeniu programu, projektu lub zadania i otrzymaniu refundacji z tych środków (bez odsetek i dyskonta od zobowiązań na wkład krajowy)",false,7,2023,0,"2016-01-28","2016-01-01"]
[2016,42370,"BRZEZINY",1021011,1,null,182,"2.1.3.1.1",null,"    odsetki i dyskonto podlegające wyłączeniu z limitu spłaty zobowiązań, o którym mowa w art. 243 ustawy, w terminie nie dłuższym niż 90 dni po zakończeniu programu, projektu lub zadania i otrzymaniu refundacji z tych środków (bez odsetek i dyskonta od zobowiązań na wkład krajowy)",false,5,2021,0,"2016-01-28","2016-01-01"]
[2016,42370,"BRZEZINY",1021011,1,null,182,"2.1.3.1.1",null,"    odsetki i dyskonto podlegające wyłączeniu z limitu spłaty zobowiązań, o którym mowa w art. 243 ustawy, w terminie nie dłuższym niż 90 dni po zakończeniu programu, projektu lub zadania i otrzymaniu refundacji z tych środków (bez odsetek i dyskonta od zobowiązań na wkład krajowy)",false,4,2020,0,"2016-01-28","2016-01-01"]
[2016,42370,"BRZEZINY",1021011,1,null,182,"2.1.3.1.1",null,"    odsetki i dyskonto podlegające wyłączeniu z limitu spłaty zobowiązań, o którym mowa w art. 243 ustawy, w terminie nie dłuższym niż 90 dni po zakończeniu programu, projektu lub zadania i otrzymaniu refundacji z tych środków (bez odsetek i dyskonta od zobowiązań na wkład krajowy)",false,8,2024,0,"2016-01-28","2016-01-01"]
[2016,42370,"BRZEZINY",1021011,1,null,182,"2.1.3.1.1",null,"    odsetki i dyskonto podlegające wyłączeniu z limitu spłaty zobowiązań, o którym mowa w art. 243 ustawy, w terminie nie dłuższym niż 90 dni po zakończeniu programu, projektu lub zadania i otrzymaniu refundacji z tych środków (bez odsetek i dyskonta od zobowiązań na wkład krajowy)",false,6,2022,0,"2016-01-28","2016-01-01"]
[2016,42370,"BRZEZINY",1021011,1,null,182,"2.1.3.1.1",null,"    odsetki i dyskonto podlegające wyłączeniu z limitu spłaty zobowiązań, o którym mowa w art. 243 ustawy, w terminie nie dłuższym niż 90 dni po zakończeniu programu, projektu lub zadania i otrzymaniu refundacji z tych środków (bez odsetek i dyskonta od zobowiązań na wkład krajowy)",false,3,2019,0,"2016-01-28","2016-01-01"]
[2016,42370,"BRZEZINY",1021011,1,null,763,12.5,null," Wydatki na wkład krajowy w związku z umową na realizację programu, projektu lub zadania finansowanego z udziałem środków, o których mowa w art. 5 ust. 1 pkt 2 ustawy bez względu na stopień finansowania tymi środkami ",true,2,2018,0,"2016-01-28","2016-01-01"]
[2016,42370,"BRZEZINY",1021011,1,null,763,12.5,null," Wydatki na wkład krajowy w związku z umową na realizację programu, projektu lub zadania finansowanego z udziałem środków, o których mowa w art. 5 ust. 1 pkt 2 ustawy bez względu na stopień finansowania tymi środkami ",true,4,2020,0,"2016-01-28","2016-01-01"]
[2016,42370,"BRZEZINY",1021011,1,null,763,12.5,null," Wydatki na wkład krajowy w związku z umową na realizację programu, projektu lub zadania finansowanego z udziałem środków, o których mowa w art. 5 ust. 1 pkt 2 ustawy bez względu na stopień finansowania tymi środkami ",true,3,2019,0,"2016-01-28","2016-01-01"]
[2016,42370,"BRZEZINY",1021011,1,null,763,12.5,null," Wydatki na wkład krajowy w związku z umową na realizację programu, projektu lub zadania finansowanego z udziałem środków, o których mowa w art. 5 ust. 1 pkt 2 ustawy bez względu na stopień finansowania tymi środkami ",true,6,2022,0,"2016-01-28","2016-01-01"]
[2016,42370,"BRZEZINY",1021011,1,null,763,12.5,null," Wydatki na wkład krajowy w związku z umową na realizację programu, projektu lub zadania finansowanego z udziałem środków, o których mowa w art. 5 ust. 1 pkt 2 ustawy bez względu na stopień finansowania tymi środkami ",true,7,2023,0,"2016-01-28","2016-01-01"]
[2016,42370,"BRZEZINY",1021011,1,null,763,12.5,null," Wydatki na wkład krajowy w związku z umową na realizację programu, projektu lub zadania finansowanego z udziałem środków, o których mowa w art. 5 ust. 1 pkt 2 ustawy bez względu na stopień finansowania tymi środkami ",true,5,2021,0,"2016-01-28","2016-01-01"]
[2016,42370,"BRZEZINY",1021011,1,null,590,11.2,null," Wydatki związane z funkcjonowaniem organów jednostki samorządu terytorialnego",true,2,2018,3500000,"2016-01-28","2016-01-01"]
[2016,42370,"BRZEZINY",1021011,1,null,763,12.5,null," Wydatki na wkład krajowy w związku z umową na realizację programu, projektu lub zadania finansowanego z udziałem środków, o których mowa w art. 5 ust. 1 pkt 2 ustawy bez względu na stopień finansowania tymi środkami ",true,8,2024,0,"2016-01-28","2016-01-01"]
[2016,42370,"BRZEZINY",1021011,1,null,763,12.5,null," Wydatki na wkład krajowy w związku z umową na realizację programu, projektu lub zadania finansowanego z udziałem środków, o których mowa w art. 5 ust. 1 pkt 2 ustawy bez względu na stopień finansowania tymi środkami ",true,0,2016,0,"2016-01-28","2016-01-01"]
[2016,42370,"BRZEZINY",1021011,1,null,763,12.5,null," Wydatki na wkład krajowy w związku z umową na realizację programu, projektu lub zadania finansowanego z udziałem środków, o których mowa w art. 5 ust. 1 pkt 2 ustawy bez względu na stopień finansowania tymi środkami ",true,1,2017,0,"2016-01-28","2016-01-01"]
[2016,42370,"BRZEZINY",1021011,1,null,410,8,null,"Relacja zrównoważenia wydatków bieżących, o której mowa w art. 242 ustawy",true,8,2024,0,"2016-01-28","2016-01-01"]
[2016,42370,"BRZEZINY",1021011,1,null,410,8,null,"Relacja zrównoważenia wydatków bieżących, o której mowa w art. 242 ustawy",true,3,2019,0,"2016-01-28","2016-01-01"]
[2016,42370,"BRZEZINY",1021011,1,null,410,8,null,"Relacja zrównoważenia wydatków bieżących, o której mowa w art. 242 ustawy",true,0,2016,0,"2016-01-28","2016-01-01"]
[2016,42370,"BRZEZINY",1021011,1,null,410,8,null,"Relacja zrównoważenia wydatków bieżących, o której mowa w art. 242 ustawy",true,2,2018,0,"2016-01-28","2016-01-01"]
[2016,42370,"BRZEZINY",1021011,1,null,410,8,null,"Relacja zrównoważenia wydatków bieżących, o której mowa w art. 242 ustawy",true,1,2017,0,"2016-01-28","2016-01-01"]
[2016,42370,"BRZEZINY",1021011,1,null,410,8,null,"Relacja zrównoważenia wydatków bieżących, o której mowa w art. 242 ustawy",true,4,2020,0,"2016-01-28","2016-01-01"]
[2016,42370,"BRZEZINY",1021011,1,null,410,8,null,"Relacja zrównoważenia wydatków bieżących, o której mowa w art. 242 ustawy",true,6,2022,0,"2016-01-28","2016-01-01"]
[2016,42370,"BRZEZINY",1021011,1,null,410,8,null,"Relacja zrównoważenia wydatków bieżących, o której mowa w art. 242 ustawy",true,5,2021,0,"2016-01-28","2016-01-01"]
[2016,42370,"BRZEZINY",1021011,1,null,410,8,null,"Relacja zrównoważenia wydatków bieżących, o której mowa w art. 242 ustawy",true,7,2023,0,"2016-01-28","2016-01-01"]
[2016,42370,"BRZEZINY",1021011,1,null,540,"9.7.1","[9.6.1]-[9.4]","  Informacja o spełnieniu wskaźnika spłaty zobowiązań określonego w art. 243 ustawy, po uwzględnieniu zobowiązań związku współtworzonego przez jednostkę samorządu terytorialnego oraz po uwzględnieniu ustawowych wyłączeń, obliczonego w oparciu o wykonanie roku poprzedzającego rok budżetowy",false,6,2022,539,"2016-01-28","2016-01-01"]
[2016,42370,"BRZEZINY",1021011,1,null,540,"9.7.1","[9.6.1]-[9.4]","  Informacja o spełnieniu wskaźnika spłaty zobowiązań określonego w art. 243 ustawy, po uwzględnieniu zobowiązań związku współtworzonego przez jednostkę samorządu terytorialnego oraz po uwzględnieniu ustawowych wyłączeń, obliczonego w oparciu o wykonanie roku poprzedzającego rok budżetowy",false,8,2024,522,"2016-01-28","2016-01-01"]
[2016,42370,"BRZEZINY",1021011,1,null,540,"9.7.1","[9.6.1]-[9.4]","  Informacja o spełnieniu wskaźnika spłaty zobowiązań określonego w art. 243 ustawy, po uwzględnieniu zobowiązań związku współtworzonego przez jednostkę samorządu terytorialnego oraz po uwzględnieniu ustawowych wyłączeń, obliczonego w oparciu o wykonanie roku poprzedzającego rok budżetowy",false,3,2019,179,"2016-01-28","2016-01-01"]
[2016,42370,"BRZEZINY",1021011,1,null,540,"9.7.1","[9.6.1]-[9.4]","  Informacja o spełnieniu wskaźnika spłaty zobowiązań określonego w art. 243 ustawy, po uwzględnieniu zobowiązań związku współtworzonego przez jednostkę samorządu terytorialnego oraz po uwzględnieniu ustawowych wyłączeń, obliczonego w oparciu o wykonanie roku poprzedzającego rok budżetowy",false,5,2021,400,"2016-01-28","2016-01-01"]
[2016,42370,"BRZEZINY",1021011,1,null,540,"9.7.1","[9.6.1]-[9.4]","  Informacja o spełnieniu wskaźnika spłaty zobowiązań określonego w art. 243 ustawy, po uwzględnieniu zobowiązań związku współtworzonego przez jednostkę samorządu terytorialnego oraz po uwzględnieniu ustawowych wyłączeń, obliczonego w oparciu o wykonanie roku poprzedzającego rok budżetowy",false,4,2020,245,"2016-01-28","2016-01-01"]
[2016,42370,"BRZEZINY",1021011,1,null,540,"9.7.1","[9.6.1]-[9.4]","  Informacja o spełnieniu wskaźnika spłaty zobowiązań określonego w art. 243 ustawy, po uwzględnieniu zobowiązań związku współtworzonego przez jednostkę samorządu terytorialnego oraz po uwzględnieniu ustawowych wyłączeń, obliczonego w oparciu o wykonanie roku poprzedzającego rok budżetowy",false,2,2018,36,"2016-01-28","2016-01-01"]
[2016,42370,"BRZEZINY",1021011,1,null,540,"9.7.1","[9.6.1]-[9.4]","  Informacja o spełnieniu wskaźnika spłaty zobowiązań określonego w art. 243 ustawy, po uwzględnieniu zobowiązań związku współtworzonego przez jednostkę samorządu terytorialnego oraz po uwzględnieniu ustawowych wyłączeń, obliczonego w oparciu o wykonanie roku poprzedzającego rok budżetowy",false,1,2017,40,"2016-01-28","2016-01-01"]
[2016,42370,"BRZEZINY",1021011,1,null,540,"9.7.1","[9.6.1]-[9.4]","  Informacja o spełnieniu wskaźnika spłaty zobowiązań określonego w art. 243 ustawy, po uwzględnieniu zobowiązań związku współtworzonego przez jednostkę samorządu terytorialnego oraz po uwzględnieniu ustawowych wyłączeń, obliczonego w oparciu o wykonanie roku poprzedzającego rok budżetowy",false,0,2016,70,"2016-01-28","2016-01-01"]
[2016,42370,"BRZEZINY",1021011,1,null,540,"9.7.1","[9.6.1]-[9.4]","  Informacja o spełnieniu wskaźnika spłaty zobowiązań określonego w art. 243 ustawy, po uwzględnieniu zobowiązań związku współtworzonego przez jednostkę samorządu terytorialnego oraz po uwzględnieniu ustawowych wyłączeń, obliczonego w oparciu o wykonanie roku poprzedzającego rok budżetowy",false,7,2023,635,"2016-01-28","2016-01-01"]
[2016,42370,"BRZEZINY",1021011,1,null,184,"2.1.3.1.2",null,"    odsetki i dyskonto podlegające wyłączeniu z limitu spłaty zobowiązań, o którym mowa w art. 243 ustawy, z tytułu zobowiązań  zaciągniętych na wkład krajowy",false,8,2024,0,"2016-01-28","2016-01-01"]
[2016,42370,"BRZEZINY",1021011,1,null,184,"2.1.3.1.2",null,"    odsetki i dyskonto podlegające wyłączeniu z limitu spłaty zobowiązań, o którym mowa w art. 243 ustawy, z tytułu zobowiązań  zaciągniętych na wkład krajowy",false,3,2019,0,"2016-01-28","2016-01-01"]
[2016,42370,"BRZEZINY",1021011,1,null,184,"2.1.3.1.2",null,"    odsetki i dyskonto podlegające wyłączeniu z limitu spłaty zobowiązań, o którym mowa w art. 243 ustawy, z tytułu zobowiązań  zaciągniętych na wkład krajowy",false,2,2018,0,"2016-01-28","2016-01-01"]
[2016,42370,"BRZEZINY",1021011,1,null,184,"2.1.3.1.2",null,"    odsetki i dyskonto podlegające wyłączeniu z limitu spłaty zobowiązań, o którym mowa w art. 243 ustawy, z tytułu zobowiązań  zaciągniętych na wkład krajowy",false,1,2017,0,"2016-01-28","2016-01-01"]
[2016,42370,"BRZEZINY",1021011,1,null,184,"2.1.3.1.2",null,"    odsetki i dyskonto podlegające wyłączeniu z limitu spłaty zobowiązań, o którym mowa w art. 243 ustawy, z tytułu zobowiązań  zaciągniętych na wkład krajowy",false,6,2022,0,"2016-01-28","2016-01-01"]
[2016,42370,"BRZEZINY",1021011,1,null,184,"2.1.3.1.2",null,"    odsetki i dyskonto podlegające wyłączeniu z limitu spłaty zobowiązań, o którym mowa w art. 243 ustawy, z tytułu zobowiązań  zaciągniętych na wkład krajowy",false,0,2016,0,"2016-01-28","2016-01-01"]
[2016,42370,"BRZEZINY",1021011,1,null,184,"2.1.3.1.2",null,"    odsetki i dyskonto podlegające wyłączeniu z limitu spłaty zobowiązań, o którym mowa w art. 243 ustawy, z tytułu zobowiązań  zaciągniętych na wkład krajowy",false,4,2020,0,"2016-01-28","2016-01-01"]
[2016,42370,"BRZEZINY",1021011,1,null,184,"2.1.3.1.2",null,"    odsetki i dyskonto podlegające wyłączeniu z limitu spłaty zobowiązań, o którym mowa w art. 243 ustawy, z tytułu zobowiązań  zaciągniętych na wkład krajowy",false,7,2023,0,"2016-01-28","2016-01-01"]
[2016,42370,"BRZEZINY",1021011,1,null,184,"2.1.3.1.2",null,"    odsetki i dyskonto podlegające wyłączeniu z limitu spłaty zobowiązań, o którym mowa w art. 243 ustawy, z tytułu zobowiązań  zaciągniętych na wkład krajowy",false,5,2021,0,"2016-01-28","2016-01-01"]
[2016,42370,"BRZEZINY",1021011,1,null,590,11.2,null," Wydatki związane z funkcjonowaniem organów jednostki samorządu terytorialnego",true,7,2023,0,"2016-01-28","2016-01-01"]
[2016,42370,"BRZEZINY",1021011,1,null,590,11.2,null," Wydatki związane z funkcjonowaniem organów jednostki samorządu terytorialnego",true,6,2022,0,"2016-01-28","2016-01-01"]
[2016,42370,"BRZEZINY",1021011,1,null,590,11.2,null," Wydatki związane z funkcjonowaniem organów jednostki samorządu terytorialnego",true,1,2017,3450000,"2016-01-28","2016-01-01"]
[2016,42370,"BRZEZINY",1021011,1,null,590,11.2,null," Wydatki związane z funkcjonowaniem organów jednostki samorządu terytorialnego",true,0,2016,3427000,"2016-01-28","2016-01-01"]
[2016,42370,"BRZEZINY",1021011,1,null,590,11.2,null," Wydatki związane z funkcjonowaniem organów jednostki samorządu terytorialnego",true,4,2020,0,"2016-01-28","2016-01-01"]
[2016,42370,"BRZEZINY",1021011,1,null,590,11.2,null," Wydatki związane z funkcjonowaniem organów jednostki samorządu terytorialnego",true,8,2024,0,"2016-01-28","2016-01-01"]
[2016,42370,"BRZEZINY",1021011,1,null,590,11.2,null," Wydatki związane z funkcjonowaniem organów jednostki samorządu terytorialnego",true,5,2021,0,"2016-01-28","2016-01-01"]
[2016,42370,"BRZEZINY",1021011,1,null,590,11.2,null," Wydatki związane z funkcjonowaniem organów jednostki samorządu terytorialnego",true,3,2019,3550000,"2016-01-28","2016-01-01"]
[2016,42370,"BRZEZINY",1021011,1,null,700,12.2,null," Dochody majątkowe  na programy, projekty lub zadania finansowane z udziałem środków, o których mowa w art. 5 ust. 1 pkt 2 i 3 ustawy",false,1,2017,0,"2016-01-28","2016-01-01"]
[2016,42370,"BRZEZINY",1021011,1,null,700,12.2,null," Dochody majątkowe  na programy, projekty lub zadania finansowane z udziałem środków, o których mowa w art. 5 ust. 1 pkt 2 i 3 ustawy",false,8,2024,0,"2016-01-28","2016-01-01"]
[2016,42370,"BRZEZINY",1021011,1,null,700,12.2,null," Dochody majątkowe  na programy, projekty lub zadania finansowane z udziałem środków, o których mowa w art. 5 ust. 1 pkt 2 i 3 ustawy",false,5,2021,0,"2016-01-28","2016-01-01"]
[2016,42370,"BRZEZINY",1021011,1,null,700,12.2,null," Dochody majątkowe  na programy, projekty lub zadania finansowane z udziałem środków, o których mowa w art. 5 ust. 1 pkt 2 i 3 ustawy",false,2,2018,0,"2016-01-28","2016-01-01"]
[2016,42370,"BRZEZINY",1021011,1,null,700,12.2,null," Dochody majątkowe  na programy, projekty lub zadania finansowane z udziałem środków, o których mowa w art. 5 ust. 1 pkt 2 i 3 ustawy",false,7,2023,0,"2016-01-28","2016-01-01"]
[2016,42370,"BRZEZINY",1021011,1,null,700,12.2,null," Dochody majątkowe  na programy, projekty lub zadania finansowane z udziałem środków, o których mowa w art. 5 ust. 1 pkt 2 i 3 ustawy",false,6,2022,0,"2016-01-28","2016-01-01"]
[2016,42370,"BRZEZINY",1021011,1,null,700,12.2,null," Dochody majątkowe  na programy, projekty lub zadania finansowane z udziałem środków, o których mowa w art. 5 ust. 1 pkt 2 i 3 ustawy",false,3,2019,0,"2016-01-28","2016-01-01"]
[2016,42370,"BRZEZINY",1021011,1,null,700,12.2,null," Dochody majątkowe  na programy, projekty lub zadania finansowane z udziałem środków, o których mowa w art. 5 ust. 1 pkt 2 i 3 ustawy",false,4,2020,0,"2016-01-28","2016-01-01"]
[2016,42370,"BRZEZINY",1021011,1,null,700,12.2,null," Dochody majątkowe  na programy, projekty lub zadania finansowane z udziałem środków, o których mowa w art. 5 ust. 1 pkt 2 i 3 ustawy",false,0,2016,0,"2016-01-28","2016-01-01"]
[2016,42370,"BRZEZINY",1021011,1,null,220,4.0999999999999996,null," Nadwyżka budżetowa z lat ubiegłych",false,7,2023,0,"2016-01-28","2016-01-01"]
[2016,42370,"BRZEZINY",1021011,1,null,220,4.0999999999999996,null," Nadwyżka budżetowa z lat ubiegłych",false,5,2021,0,"2016-01-28","2016-01-01"]
[2016,42370,"BRZEZINY",1021011,1,null,220,4.0999999999999996,null," Nadwyżka budżetowa z lat ubiegłych",false,1,2017,0,"2016-01-28","2016-01-01"]
[2016,42370,"BRZEZINY",1021011,1,null,220,4.0999999999999996,null," Nadwyżka budżetowa z lat ubiegłych",false,8,2024,0,"2016-01-28","2016-01-01"]
[2016,42370,"BRZEZINY",1021011,1,null,220,4.0999999999999996,null," Nadwyżka budżetowa z lat ubiegłych",false,6,2022,0,"2016-01-28","2016-01-01"]
[2016,42370,"BRZEZINY",1021011,1,null,220,4.0999999999999996,null," Nadwyżka budżetowa z lat ubiegłych",false,2,2018,0,"2016-01-28","2016-01-01"]
[2016,42370,"BRZEZINY",1021011,1,null,220,4.0999999999999996,null," Nadwyżka budżetowa z lat ubiegłych",false,3,2019,0,"2016-01-28","2016-01-01"]
[2016,42370,"BRZEZINY",1021011,1,null,220,4.0999999999999996,null," Nadwyżka budżetowa z lat ubiegłych",false,0,2016,0,"2016-01-28","2016-01-01"]
[2016,42370,"BRZEZINY",1021011,1,null,220,4.0999999999999996,null," Nadwyżka budżetowa z lat ubiegłych",false,4,2020,0,"2016-01-28","2016-01-01"]
[2016,42370,"BRZEZINY",1021011,1,null,336,"5.1.1.3",null,"   kwota przypadających na dany rok kwot ustawowych wyłączeń innych niż określone w art. 243 ustawy",true,0,2016,0,"2016-01-28","2016-01-01"]
[2016,42370,"BRZEZINY",1021011,1,null,336,"5.1.1.3",null,"   kwota przypadających na dany rok kwot ustawowych wyłączeń innych niż określone w art. 243 ustawy",true,2,2018,0,"2016-01-28","2016-01-01"]
[2016,42370,"BRZEZINY",1021011,1,null,336,"5.1.1.3",null,"   kwota przypadających na dany rok kwot ustawowych wyłączeń innych niż określone w art. 243 ustawy",true,1,2017,0,"2016-01-28","2016-01-01"]
[2016,42370,"BRZEZINY",1021011,1,null,336,"5.1.1.3",null,"   kwota przypadających na dany rok kwot ustawowych wyłączeń innych niż określone w art. 243 ustawy",true,5,2021,0,"2016-01-28","2016-01-01"]
[2016,42370,"BRZEZINY",1021011,1,null,336,"5.1.1.3",null,"   kwota przypadających na dany rok kwot ustawowych wyłączeń innych niż określone w art. 243 ustawy",true,8,2024,0,"2016-01-28","2016-01-01"]
[2016,42370,"BRZEZINY",1021011,1,null,336,"5.1.1.3",null,"   kwota przypadających na dany rok kwot ustawowych wyłączeń innych niż określone w art. 243 ustawy",true,7,2023,0,"2016-01-28","2016-01-01"]
[2016,42370,"BRZEZINY",1021011,1,null,336,"5.1.1.3",null,"   kwota przypadających na dany rok kwot ustawowych wyłączeń innych niż określone w art. 243 ustawy",true,3,2019,0,"2016-01-28","2016-01-01"]
[2016,42370,"BRZEZINY",1021011,1,null,336,"5.1.1.3",null,"   kwota przypadających na dany rok kwot ustawowych wyłączeń innych niż określone w art. 243 ustawy",true,6,2022,0,"2016-01-28","2016-01-01"]
[2016,42370,"BRZEZINY",1021011,1,null,336,"5.1.1.3",null,"   kwota przypadających na dany rok kwot ustawowych wyłączeń innych niż określone w art. 243 ustawy",true,4,2020,0,"2016-01-28","2016-01-01"]
[2016,42370,"BRZEZINY",1021011,1,null,790,13,null,"Kwoty dotyczące przejęcia i spłaty zobowiązań po samodzielnych publicznych zakładach opieki zdrowotnej oraz pokrycia ujemnego wyniku ",true,3,2019,0,"2016-01-28","2016-01-01"]
[2016,42370,"BRZEZINY",1021011,1,null,790,13,null,"Kwoty dotyczące przejęcia i spłaty zobowiązań po samodzielnych publicznych zakładach opieki zdrowotnej oraz pokrycia ujemnego wyniku ",true,5,2021,0,"2016-01-28","2016-01-01"]
[2016,42370,"BRZEZINY",1021011,1,null,790,13,null,"Kwoty dotyczące przejęcia i spłaty zobowiązań po samodzielnych publicznych zakładach opieki zdrowotnej oraz pokrycia ujemnego wyniku ",true,7,2023,0,"2016-01-28","2016-01-01"]
[2016,42370,"BRZEZINY",1021011,1,null,790,13,null,"Kwoty dotyczące przejęcia i spłaty zobowiązań po samodzielnych publicznych zakładach opieki zdrowotnej oraz pokrycia ujemnego wyniku ",true,1,2017,0,"2016-01-28","2016-01-01"]
[2016,42370,"BRZEZINY",1021011,1,null,790,13,null,"Kwoty dotyczące przejęcia i spłaty zobowiązań po samodzielnych publicznych zakładach opieki zdrowotnej oraz pokrycia ujemnego wyniku ",true,2,2018,0,"2016-01-28","2016-01-01"]
[2016,42370,"BRZEZINY",1021011,1,null,790,13,null,"Kwoty dotyczące przejęcia i spłaty zobowiązań po samodzielnych publicznych zakładach opieki zdrowotnej oraz pokrycia ujemnego wyniku ",true,4,2020,0,"2016-01-28","2016-01-01"]
[2016,42370,"BRZEZINY",1021011,1,null,790,13,null,"Kwoty dotyczące przejęcia i spłaty zobowiązań po samodzielnych publicznych zakładach opieki zdrowotnej oraz pokrycia ujemnego wyniku ",true,8,2024,0,"2016-01-28","2016-01-01"]
[2016,42370,"BRZEZINY",1021011,1,null,790,13,null,"Kwoty dotyczące przejęcia i spłaty zobowiązań po samodzielnych publicznych zakładach opieki zdrowotnej oraz pokrycia ujemnego wyniku ",true,0,2016,0,"2016-01-28","2016-01-01"]
[2016,42370,"BRZEZINY",1021011,1,null,790,13,null,"Kwoty dotyczące przejęcia i spłaty zobowiązań po samodzielnych publicznych zakładach opieki zdrowotnej oraz pokrycia ujemnego wyniku ",true,6,2022,0,"2016-01-28","2016-01-01"]
[2016,42370,"BRZEZINY",1021011,1,null,100,"1.2.1",null,"  ze sprzedaży majątku",true,3,2019,0,"2016-01-28","2016-01-01"]
[2016,42370,"BRZEZINY",1021011,1,null,100,"1.2.1",null,"  ze sprzedaży majątku",true,2,2018,0,"2016-01-28","2016-01-01"]
[2016,42370,"BRZEZINY",1021011,1,null,100,"1.2.1",null,"  ze sprzedaży majątku",true,7,2023,0,"2016-01-28","2016-01-01"]
[2016,42370,"BRZEZINY",1021011,1,null,100,"1.2.1",null,"  ze sprzedaży majątku",true,0,2016,120000,"2016-01-28","2016-01-01"]
[2016,42370,"BRZEZINY",1021011,1,null,100,"1.2.1",null,"  ze sprzedaży majątku",true,6,2022,0,"2016-01-28","2016-01-01"]
[2016,42370,"BRZEZINY",1021011,1,null,100,"1.2.1",null,"  ze sprzedaży majątku",true,8,2024,0,"2016-01-28","2016-01-01"]
[2016,42370,"BRZEZINY",1021011,1,null,100,"1.2.1",null,"  ze sprzedaży majątku",true,1,2017,0,"2016-01-28","2016-01-01"]
[2016,42370,"BRZEZINY",1021011,1,null,100,"1.2.1",null,"  ze sprzedaży majątku",true,5,2021,0,"2016-01-28","2016-01-01"]
[2016,42370,"BRZEZINY",1021011,1,null,100,"1.2.1",null,"  ze sprzedaży majątku",true,4,2020,0,"2016-01-28","2016-01-01"]
[2016,42370,"BRZEZINY",1021011,1,null,340,5.2,null," Inne rozchody niezwiązane ze spłatą długu",false,0,2016,0,"2016-01-28","2016-01-01"]
[2016,42370,"BRZEZINY",1021011,1,null,340,5.2,null," Inne rozchody niezwiązane ze spłatą długu",false,2,2018,0,"2016-01-28","2016-01-01"]
[2016,42370,"BRZEZINY",1021011,1,null,340,5.2,null," Inne rozchody niezwiązane ze spłatą długu",false,7,2023,0,"2016-01-28","2016-01-01"]
[2016,42370,"BRZEZINY",1021011,1,null,340,5.2,null," Inne rozchody niezwiązane ze spłatą długu",false,4,2020,0,"2016-01-28","2016-01-01"]
[2016,42370,"BRZEZINY",1021011,1,null,340,5.2,null," Inne rozchody niezwiązane ze spłatą długu",false,1,2017,0,"2016-01-28","2016-01-01"]
[2016,42370,"BRZEZINY",1021011,1,null,340,5.2,null," Inne rozchody niezwiązane ze spłatą długu",false,6,2022,0,"2016-01-28","2016-01-01"]
[2016,42370,"BRZEZINY",1021011,1,null,340,5.2,null," Inne rozchody niezwiązane ze spłatą długu",false,8,2024,0,"2016-01-28","2016-01-01"]
[2016,42370,"BRZEZINY",1021011,1,null,340,5.2,null," Inne rozchody niezwiązane ze spłatą długu",false,3,2019,0,"2016-01-28","2016-01-01"]
[2016,42370,"BRZEZINY",1021011,1,null,340,5.2,null," Inne rozchody niezwiązane ze spłatą długu",false,5,2021,0,"2016-01-28","2016-01-01"]
[2016,42370,"BRZEZINY",1021011,1,null,332,"5.1.1.1",null,"   kwota przypadających na dany rok kwot ustawowych wyłączeń określonych w art. 243 ust. 3 ustawy",true,1,2017,0,"2016-01-28","2016-01-01"]
[2016,42370,"BRZEZINY",1021011,1,null,332,"5.1.1.1",null,"   kwota przypadających na dany rok kwot ustawowych wyłączeń określonych w art. 243 ust. 3 ustawy",true,4,2020,0,"2016-01-28","2016-01-01"]
[2016,42370,"BRZEZINY",1021011,1,null,332,"5.1.1.1",null,"   kwota przypadających na dany rok kwot ustawowych wyłączeń określonych w art. 243 ust. 3 ustawy",true,3,2019,0,"2016-01-28","2016-01-01"]
[2016,42370,"BRZEZINY",1021011,1,null,332,"5.1.1.1",null,"   kwota przypadających na dany rok kwot ustawowych wyłączeń określonych w art. 243 ust. 3 ustawy",true,6,2022,0,"2016-01-28","2016-01-01"]
[2016,42370,"BRZEZINY",1021011,1,null,332,"5.1.1.1",null,"   kwota przypadających na dany rok kwot ustawowych wyłączeń określonych w art. 243 ust. 3 ustawy",true,8,2024,0,"2016-01-28","2016-01-01"]
[2016,42370,"BRZEZINY",1021011,1,null,332,"5.1.1.1",null,"   kwota przypadających na dany rok kwot ustawowych wyłączeń określonych w art. 243 ust. 3 ustawy",true,2,2018,0,"2016-01-28","2016-01-01"]
[2016,42370,"BRZEZINY",1021011,1,null,332,"5.1.1.1",null,"   kwota przypadających na dany rok kwot ustawowych wyłączeń określonych w art. 243 ust. 3 ustawy",true,7,2023,0,"2016-01-28","2016-01-01"]
[2016,42370,"BRZEZINY",1021011,1,null,332,"5.1.1.1",null,"   kwota przypadających na dany rok kwot ustawowych wyłączeń określonych w art. 243 ust. 3 ustawy",true,0,2016,0,"2016-01-28","2016-01-01"]
[2016,42370,"BRZEZINY",1021011,1,null,332,"5.1.1.1",null,"   kwota przypadających na dany rok kwot ustawowych wyłączeń określonych w art. 243 ust. 3 ustawy",true,5,2021,0,"2016-01-28","2016-01-01"]